Info: Starting: Create simulation model
Info: qsys-generate /home/gsanahuj/svn/intel-aero_src/trunk/intel-aero-fpga/aero_rtf_kit_hds/adc.qsys --simulation=VERILOG --allow-mixed-language-simulation --output-directory=/home/gsanahuj/svn/intel-aero_src/trunk/intel-aero-fpga/aero_rtf_kit_hds/adc/simulation --family="MAX 10" --part=10M08SAM153I7G
Progress: Loading aero_rtf_kit_hds/adc.qsys
Progress: Reading input file
Progress: Adding adc [altera_modular_adc 20.1]
Progress: Parameterizing module adc
Progress: Adding clk_0 [clock_source 20.1]
Progress: Parameterizing module clk_0
Progress: Building connections
Progress: Parameterizing connections
Progress: Validating
Progress: Done reading input file
Info: adc: Generating adc "adc" for SIM_VERILOG
Info: adc: "adc" instantiated altera_modular_adc "adc"
Info: rst_controller: "adc" instantiated altera_reset_controller "rst_controller"
Info: control_internal: "adc" instantiated altera_modular_adc_control "control_internal"
Info: sequencer_internal: "adc" instantiated altera_modular_adc_sequencer "sequencer_internal"
Info: adc: Done "adc" with 5 modules, 14 files
Info: qsys-generate succeeded.
Info: Finished: Create simulation model
Info: Starting: Create Modelsim Project.
Info: sim-script-gen --spd=/home/gsanahuj/svn/intel-aero_src/trunk/intel-aero-fpga/aero_rtf_kit_hds/adc/adc.spd --output-directory=/home/gsanahuj/svn/intel-aero_src/trunk/intel-aero-fpga/aero_rtf_kit_hds/adc/simulation/ --use-relative-paths=true
Info: Doing: ip-make-simscript --spd=/home/gsanahuj/svn/intel-aero_src/trunk/intel-aero-fpga/aero_rtf_kit_hds/adc/adc.spd --output-directory=/home/gsanahuj/svn/intel-aero_src/trunk/intel-aero-fpga/aero_rtf_kit_hds/adc/simulation/ --use-relative-paths=true
Info: Generating the following file(s) for MODELSIM simulator in /home/gsanahuj/svn/intel-aero_src/trunk/intel-aero-fpga/aero_rtf_kit_hds/adc/simulation/ directory:
Info: 	mentor/msim_setup.tcl
Info: Generating the following file(s) for VCS simulator in /home/gsanahuj/svn/intel-aero_src/trunk/intel-aero-fpga/aero_rtf_kit_hds/adc/simulation/ directory:
Info: 	synopsys/vcs/vcs_setup.sh
Info: Generating the following file(s) for VCSMX simulator in /home/gsanahuj/svn/intel-aero_src/trunk/intel-aero-fpga/aero_rtf_kit_hds/adc/simulation/ directory:
Info: 	synopsys/vcsmx/synopsys_sim.setup
Info: 	synopsys/vcsmx/vcsmx_setup.sh
Info: Generating the following file(s) for NCSIM simulator in /home/gsanahuj/svn/intel-aero_src/trunk/intel-aero-fpga/aero_rtf_kit_hds/adc/simulation/ directory:
Info: 	cadence/cds.lib
Info: 	cadence/hdl.var
Info: 	cadence/ncsim_setup.sh
Info: 	4 .cds.lib files in cadence/cds_libs/ directory
Info: Generating the following file(s) for RIVIERA simulator in /home/gsanahuj/svn/intel-aero_src/trunk/intel-aero-fpga/aero_rtf_kit_hds/adc/simulation/ directory:
Info: 	aldec/rivierapro_setup.tcl
Info: For information on how to simulate your IP, see the explanatory comments in the simulator-specific subdirectories under /home/gsanahuj/svn/intel-aero_src/trunk/intel-aero-fpga/aero_rtf_kit_hds/adc/simulation/.
Info: Regenerate these scripts whenever you make any change to any Quartus-generated IP in your project.
Info: Finished: Create Modelsim Project.
Info: Starting: Create block symbol file (.bsf)
Info: qsys-generate /home/gsanahuj/svn/intel-aero_src/trunk/intel-aero-fpga/aero_rtf_kit_hds/adc.qsys --block-symbol-file --output-directory=/home/gsanahuj/svn/intel-aero_src/trunk/intel-aero-fpga/aero_rtf_kit_hds/adc --family="MAX 10" --part=10M08SAM153I7G
Progress: Loading aero_rtf_kit_hds/adc.qsys
Progress: Reading input file
Progress: Adding adc [altera_modular_adc 20.1]
Progress: Parameterizing module adc
Progress: Adding clk_0 [clock_source 20.1]
Progress: Parameterizing module clk_0
Progress: Building connections
Progress: Parameterizing connections
Progress: Validating
Progress: Done reading input file
Info: qsys-generate succeeded.
Info: Finished: Create block symbol file (.bsf)
Info: 
Info: Starting: Create HDL design files for synthesis
Info: qsys-generate /home/gsanahuj/svn/intel-aero_src/trunk/intel-aero-fpga/aero_rtf_kit_hds/adc.qsys --synthesis=VERILOG --output-directory=/home/gsanahuj/svn/intel-aero_src/trunk/intel-aero-fpga/aero_rtf_kit_hds/adc/synthesis --family="MAX 10" --part=10M08SAM153I7G
Progress: Loading aero_rtf_kit_hds/adc.qsys
Progress: Reading input file
Progress: Adding adc [altera_modular_adc 20.1]
Progress: Parameterizing module adc
Progress: Adding clk_0 [clock_source 20.1]
Progress: Parameterizing module clk_0
Progress: Building connections
Progress: Parameterizing connections
Progress: Validating
Progress: Done reading input file
Info: adc: Generating adc "adc" for QUARTUS_SYNTH
Info: adc: "adc" instantiated altera_modular_adc "adc"
Info: rst_controller: "adc" instantiated altera_reset_controller "rst_controller"
Info: control_internal: "adc" instantiated altera_modular_adc_control "control_internal"
Info: sequencer_internal: "adc" instantiated altera_modular_adc_sequencer "sequencer_internal"
Info: adc: Done "adc" with 5 modules, 15 files
Info: qsys-generate succeeded.
Info: Finished: Create HDL design files for synthesis
