# WaveFront *.mtl file (generated by Autodesk ATF)

newmtl 191,191,191
Ka 0.749020 0.749020 0.749020
Kd 0.749020 0.749020 0.749020
Ks 0.000000 0.000000 0.000000
Ns 300.000000
d 1.000000

newmtl 196,194,204
Ka 0.768627 0.760784 0.800000
Kd 0.768627 0.760784 0.800000
Ks 0.768627 0.760784 0.800000
Ns 1000.000000
d 1.000000

newmtl 173,173,173
Ka 0.678431 0.678431 0.678431
Kd 0.678431 0.678431 0.678431
Ks 0.678431 0.678431 0.678431
Ns 1000.000000
d 1.000000

newmtl 190,188,186
Ka 0.745098 0.737255 0.729412
Kd 0.745098 0.737255 0.729412
Ks 0.745098 0.737255 0.729412
Ns 1000.000000
d 1.000000

newmtl 199,143,28
Ka 0.780392 0.560784 0.109804
Kd 0.780392 0.560784 0.109804
Ks 0.780392 0.560784 0.109804
Ns 1000.000000
d 1.000000

