﻿\version "2.16.0"
\include "1413-Faure-Elegie-Global.ily"                
#(set-global-staff-size 20)  
#(ly:set-option 'point-and-click #f)

cInstrument = "Cor 4 en Fa"

\paper { 		%% réglages généraux dans Global
    %% first-page-number = 2
}	%% fin paper

\book {
\header {
    title = \cTitre
    subsubtitle = \cSousTitre
    composer =	\cCompositeur
		copyright = \cCopyright
		poet = \markup \box { \pad-around #1 { \cInstrument }}
		instrumentHeader = 	\markup { \cInstrument }	
}	%% fin header

\score {
		\new Staff << 
			\reperes \silencesMulti
		 	<<	\keepWithTag #'SansTon \include "1413-Faure-Elegie-Trame.ily" 
				\keepWithTag #'partie \include "Mus/1413-12-C4.ily"
			>>
		>>
}	%% fin score
}	%% fin book	
