<?xml version="1.0" encoding="UTF-8" standalone="no"?>
<!-- Created with Inkscape (http://www.inkscape.org/) -->

<svg
   xmlns:dc="http://purl.org/dc/elements/1.1/"
   xmlns:cc="http://creativecommons.org/ns#"
   xmlns:rdf="http://www.w3.org/1999/02/22-rdf-syntax-ns#"
   xmlns:svg="http://www.w3.org/2000/svg"
   xmlns="http://www.w3.org/2000/svg"
   xmlns:sodipodi="http://sodipodi.sourceforge.net/DTD/sodipodi-0.dtd"
   xmlns:inkscape="http://www.inkscape.org/namespaces/inkscape"
   width="180mm"
   height="180mm"
   viewBox="0 0 180 180"
   version="1.1"
   id="svg5580"
   inkscape:version="0.92.4 (5da689c313, 2019-01-14)"
   sodipodi:docname="picasoft-logo-doc.svg"
   inkscape:export-filename="/home/adgl/Documents/Picasoft/documents/logos/picasoft-logos-services-websites/png/picasoft-logo-doc.png"
   inkscape:export-xdpi="95.370003"
   inkscape:export-ydpi="95.370003"
   enable-background="new">
  <defs
     id="defs5574">
    <inkscape:path-effect
       effect="skeletal"
       id="path-effect953"
       is_visible="true"
       pattern="M 0,5 C 0,2.24 2.24,0 5,0 7.76,0 10,2.24 10,5 10,7.76 7.76,10 5,10 2.24,10 0,7.76 0,5 Z"
       copytype="single_stretched"
       prop_scale="0.076987651"
       scale_y_rel="false"
       spacing="0"
       normal_offset="0"
       tang_offset="0"
       prop_units="false"
       vertical_pattern="false"
       fuse_tolerance="0" />
    <inkscape:path-effect
       effect="spiro"
       id="path-effect951"
       is_visible="true" />
    <inkscape:path-effect
       effect="skeletal"
       id="path-effect926"
       is_visible="true"
       pattern="M 0,5 C 0,2.24 2.24,0 5,0 7.76,0 10,2.24 10,5 10,7.76 7.76,10 5,10 2.24,10 0,7.76 0,5 Z"
       copytype="single_stretched"
       prop_scale="0.046794447"
       scale_y_rel="false"
       spacing="0"
       normal_offset="0"
       tang_offset="0"
       prop_units="false"
       vertical_pattern="false"
       fuse_tolerance="0" />
    <inkscape:path-effect
       effect="spiro"
       id="path-effect924"
       is_visible="true" />
    <inkscape:path-effect
       effect="skeletal"
       id="path-effect920"
       is_visible="true"
       pattern="M 0,5 C 0,2.24 2.24,0 5,0 7.76,0 10,2.24 10,5 10,7.76 7.76,10 5,10 2.24,10 0,7.76 0,5 Z"
       copytype="single_stretched"
       prop_scale="0.091463394"
       scale_y_rel="false"
       spacing="0"
       normal_offset="0"
       tang_offset="0"
       prop_units="false"
       vertical_pattern="false"
       fuse_tolerance="0" />
    <inkscape:path-effect
       effect="spiro"
       id="path-effect918"
       is_visible="true" />
    <inkscape:path-effect
       effect="skeletal"
       id="path-effect914"
       is_visible="true"
       pattern="M 0,5 C 0,2.24 2.24,0 5,0 7.76,0 10,2.24 10,5 10,7.76 7.76,10 5,10 2.24,10 0,7.76 0,5 Z"
       copytype="single_stretched"
       prop_scale="0.26458334"
       scale_y_rel="false"
       spacing="0"
       normal_offset="0"
       tang_offset="0"
       prop_units="false"
       vertical_pattern="false"
       fuse_tolerance="0" />
    <inkscape:path-effect
       effect="spiro"
       id="path-effect912"
       is_visible="true" />
    <inkscape:path-effect
       effect="skeletal"
       id="path-effect908"
       is_visible="true"
       pattern="M 0,5 C 0,2.24 2.24,0 5,0 7.76,0 10,2.24 10,5 10,7.76 7.76,10 5,10 2.24,10 0,7.76 0,5 Z"
       copytype="single_stretched"
       prop_scale="0.26458334"
       scale_y_rel="false"
       spacing="0"
       normal_offset="0"
       tang_offset="0"
       prop_units="false"
       vertical_pattern="false"
       fuse_tolerance="0" />
    <inkscape:path-effect
       effect="skeletal"
       id="path-effect904"
       is_visible="true"
       pattern="M 0,5 C 0,2.24 2.24,0 5,0 7.76,0 10,2.24 10,5 10,7.76 7.76,10 5,10 2.24,10 0,7.76 0,5 Z"
       copytype="single_stretched"
       prop_scale="0.13992507"
       scale_y_rel="false"
       spacing="0"
       normal_offset="0"
       tang_offset="0"
       prop_units="false"
       vertical_pattern="false"
       fuse_tolerance="0" />
    <inkscape:path-effect
       effect="skeletal"
       id="path-effect10492"
       is_visible="true"
       pattern="M 0,5 C 0,2.24 2.24,0 5,0 7.76,0 10,2.24 10,5 10,7.76 7.76,10 5,10 2.24,10 0,7.76 0,5 Z"
       copytype="single_stretched"
       prop_scale="0.054093225"
       scale_y_rel="false"
       spacing="0"
       normal_offset="0"
       tang_offset="0"
       prop_units="false"
       vertical_pattern="false"
       fuse_tolerance="0" />
    <inkscape:path-effect
       effect="bspline"
       id="path-effect10490"
       is_visible="true"
       weight="33.333333"
       steps="2"
       helper_size="0"
       apply_no_weight="true"
       apply_with_weight="true"
       only_selected="false" />
    <inkscape:path-effect
       effect="skeletal"
       id="path-effect10486"
       is_visible="true"
       pattern="M 0,5 C 0,2.24 2.24,0 5,0 7.76,0 10,2.24 10,5 10,7.76 7.76,10 5,10 2.24,10 0,7.76 0,5 Z"
       copytype="single_stretched"
       prop_scale="0.14196706"
       scale_y_rel="false"
       spacing="0"
       normal_offset="0"
       tang_offset="0"
       prop_units="false"
       vertical_pattern="false"
       fuse_tolerance="0" />
    <inkscape:path-effect
       effect="bspline"
       id="path-effect10484"
       is_visible="true"
       weight="33.333333"
       steps="2"
       helper_size="0"
       apply_no_weight="true"
       apply_with_weight="true"
       only_selected="false" />
    <inkscape:path-effect
       effect="skeletal"
       id="path-effect10480"
       is_visible="true"
       pattern="M 0,5 C 0,2.24 2.24,0 5,0 7.76,0 10,2.24 10,5 10,7.76 7.76,10 5,10 2.24,10 0,7.76 0,5 Z"
       copytype="single_stretched"
       prop_scale="0.26458334"
       scale_y_rel="false"
       spacing="0"
       normal_offset="0"
       tang_offset="0"
       prop_units="false"
       vertical_pattern="false"
       fuse_tolerance="0" />
    <inkscape:path-effect
       effect="bspline"
       id="path-effect10478"
       is_visible="true"
       weight="33.333333"
       steps="2"
       helper_size="0"
       apply_no_weight="true"
       apply_with_weight="true"
       only_selected="false" />
    <inkscape:path-effect
       effect="skeletal"
       id="path-effect10474"
       is_visible="true"
       pattern="M 0,5 C 0,2.24 2.24,0 5,0 7.76,0 10,2.24 10,5 10,7.76 7.76,10 5,10 2.24,10 0,7.76 0,5 Z"
       copytype="single_stretched"
       prop_scale="0.26458334"
       scale_y_rel="false"
       spacing="0"
       normal_offset="0"
       tang_offset="0"
       prop_units="false"
       vertical_pattern="false"
       fuse_tolerance="0" />
    <inkscape:path-effect
       effect="spiro"
       id="path-effect10472"
       is_visible="true" />
    <filter
       inkscape:collect="always"
       style="color-interpolation-filters:sRGB"
       id="filter4707">
      <feBlend
         inkscape:collect="always"
         mode="soft-light"
         in2="BackgroundImage"
         id="feBlend4709" />
    </filter>
    <inkscape:path-effect
       effect="skeletal"
       id="path-effect4760-0-93-2-6"
       is_visible="true"
       pattern="m 721.626,383.1137 c 0,-2.76 2.24,-5 5,-5 2.76,0 5,2.24 5,5 0,2.76 -2.24,5 -5,5 -2.76,0 -5,-2.24 -5,-5 z"
       copytype="single_stretched"
       prop_scale="2"
       scale_y_rel="false"
       spacing="0"
       normal_offset="0"
       tang_offset="0"
       prop_units="false"
       vertical_pattern="false"
       fuse_tolerance="0" />
    <inkscape:path-effect
       effect="skeletal"
       id="path-effect4764-7-6-1-2"
       is_visible="true"
       pattern="m 721.626,383.1137 c 0,-2.76 2.24,-5 5,-5 2.76,0 5,2.24 5,5 0,2.76 -2.24,5 -5,5 -2.76,0 -5,-2.24 -5,-5 z"
       copytype="single_stretched"
       prop_scale="2"
       scale_y_rel="false"
       spacing="0"
       normal_offset="0"
       tang_offset="0"
       prop_units="false"
       vertical_pattern="false"
       fuse_tolerance="0" />
    <inkscape:path-effect
       effect="skeletal"
       id="path-effect4768-2-0-2-9"
       is_visible="true"
       pattern="m 721.626,383.1137 c 0,-2.76 2.24,-5 5,-5 2.76,0 5,2.24 5,5 0,2.76 -2.24,5 -5,5 -2.76,0 -5,-2.24 -5,-5 z"
       copytype="single_stretched"
       prop_scale="2"
       scale_y_rel="false"
       spacing="0"
       normal_offset="0"
       tang_offset="0"
       prop_units="false"
       vertical_pattern="false"
       fuse_tolerance="0" />
    <inkscape:path-effect
       effect="skeletal"
       id="path-effect4900-6-0-1"
       is_visible="true"
       pattern="m 0,297 c 0,-2.76 2.24,-5 5,-5 2.76,0 5,2.24 5,5 0,2.76 -2.24,5 -5,5 -2.76,0 -5,-2.24 -5,-5 z"
       copytype="single_stretched"
       prop_scale="0.85957818"
       scale_y_rel="false"
       spacing="0"
       normal_offset="0"
       tang_offset="0"
       prop_units="false"
       vertical_pattern="false"
       fuse_tolerance="0" />
    <inkscape:path-effect
       effect="skeletal"
       id="path-effect4904-2-7-2"
       is_visible="true"
       pattern="m 0,297 c 0,-2.76 2.24,-5 5,-5 2.76,0 5,2.24 5,5 0,2.76 -2.24,5 -5,5 -2.76,0 -5,-2.24 -5,-5 z"
       copytype="single_stretched"
       prop_scale="0.7712"
       scale_y_rel="false"
       spacing="0"
       normal_offset="0"
       tang_offset="0"
       prop_units="false"
       vertical_pattern="false"
       fuse_tolerance="0" />
    <inkscape:path-effect
       effect="skeletal"
       id="path-effect4908-6-3-7"
       is_visible="true"
       pattern="m 0,297 c 0,-2.76 2.24,-5 5,-5 2.76,0 5,2.24 5,5 0,2.76 -2.24,5 -5,5 -2.76,0 -5,-2.24 -5,-5 z"
       copytype="single_stretched"
       prop_scale="2"
       scale_y_rel="false"
       spacing="0"
       normal_offset="0"
       tang_offset="0"
       prop_units="false"
       vertical_pattern="false"
       fuse_tolerance="0" />
    <inkscape:path-effect
       effect="skeletal"
       id="path-effect4934-1-1-0"
       is_visible="true"
       pattern="M 0,5 C 0,2.24 2.24,0 5,0 7.76,0 10,2.24 10,5 10,7.76 7.76,10 5,10 2.24,10 0,7.76 0,5 Z"
       copytype="single_stretched"
       prop_scale="2"
       scale_y_rel="false"
       spacing="0"
       normal_offset="0"
       tang_offset="0"
       prop_units="false"
       vertical_pattern="false"
       fuse_tolerance="0" />
    <inkscape:path-effect
       effect="skeletal"
       id="path-effect4938-8-1-9"
       is_visible="true"
       pattern="M 0,5 C 0,2.24 2.24,0 5,0 7.76,0 10,2.24 10,5 10,7.76 7.76,10 5,10 2.24,10 0,7.76 0,5 Z"
       copytype="single_stretched"
       prop_scale="2"
       scale_y_rel="false"
       spacing="0"
       normal_offset="0"
       tang_offset="0"
       prop_units="false"
       vertical_pattern="false"
       fuse_tolerance="0" />
    <inkscape:path-effect
       effect="skeletal"
       id="path-effect5047-7-9-3"
       is_visible="true"
       pattern="M 0,5 C 0,2.24 2.24,0 5,0 7.76,0 10,2.24 10,5 10,7.76 7.76,10 5,10 2.24,10 0,7.76 0,5 Z"
       copytype="single_stretched"
       prop_scale="1.4801064"
       scale_y_rel="false"
       spacing="0"
       normal_offset="0"
       tang_offset="0"
       prop_units="false"
       vertical_pattern="false"
       fuse_tolerance="0" />
    <inkscape:path-effect
       effect="skeletal"
       id="path-effect5051-9-0-6"
       is_visible="true"
       pattern="M 0,5 C 0,2.24 2.24,0 5,0 7.76,0 10,2.24 10,5 10,7.76 7.76,10 5,10 2.24,10 0,7.76 0,5 Z"
       copytype="single_stretched"
       prop_scale="0.96784374"
       scale_y_rel="false"
       spacing="0"
       normal_offset="0"
       tang_offset="0"
       prop_units="false"
       vertical_pattern="false"
       fuse_tolerance="0" />
    <inkscape:path-effect
       effect="skeletal"
       id="path-effect81-7-0"
       is_visible="true"
       pattern="m 407.13088,269.67947 c 0,-2.76 2.24,-5 5,-5 2.76,0 5,2.24 5,5 0,2.76 -2.24,5 -5,5 -2.76,0 -5,-2.24 -5,-5 z"
       copytype="single_stretched"
       prop_scale="0.34586333"
       scale_y_rel="false"
       spacing="0"
       normal_offset="0"
       tang_offset="0"
       prop_units="false"
       vertical_pattern="false"
       fuse_tolerance="0" />
    <inkscape:path-effect
       effect="bspline"
       id="path-effect10490-7"
       is_visible="true"
       weight="33.333333"
       steps="2"
       helper_size="0"
       apply_no_weight="true"
       apply_with_weight="true"
       only_selected="false" />
    <inkscape:path-effect
       effect="skeletal"
       id="path-effect10492-1"
       is_visible="true"
       pattern="M 0,5 C 0,2.24 2.24,0 5,0 7.76,0 10,2.24 10,5 10,7.76 7.76,10 5,10 2.24,10 0,7.76 0,5 Z"
       copytype="single_stretched"
       prop_scale="0.054093225"
       scale_y_rel="false"
       spacing="0"
       normal_offset="0"
       tang_offset="0"
       prop_units="false"
       vertical_pattern="false"
       fuse_tolerance="0" />
    <inkscape:path-effect
       effect="bspline"
       id="path-effect10490-2"
       is_visible="true"
       weight="33.333333"
       steps="2"
       helper_size="0"
       apply_no_weight="true"
       apply_with_weight="true"
       only_selected="false" />
    <inkscape:path-effect
       effect="skeletal"
       id="path-effect10492-7"
       is_visible="true"
       pattern="M 0,5 C 0,2.24 2.24,0 5,0 7.76,0 10,2.24 10,5 10,7.76 7.76,10 5,10 2.24,10 0,7.76 0,5 Z"
       copytype="single_stretched"
       prop_scale="0.054093225"
       scale_y_rel="false"
       spacing="0"
       normal_offset="0"
       tang_offset="0"
       prop_units="false"
       vertical_pattern="false"
       fuse_tolerance="0" />
    <inkscape:path-effect
       effect="bspline"
       id="path-effect10490-26"
       is_visible="true"
       weight="33.333333"
       steps="2"
       helper_size="0"
       apply_no_weight="true"
       apply_with_weight="true"
       only_selected="false" />
    <inkscape:path-effect
       effect="skeletal"
       id="path-effect10492-10"
       is_visible="true"
       pattern="M 0,5 C 0,2.24 2.24,0 5,0 7.76,0 10,2.24 10,5 10,7.76 7.76,10 5,10 2.24,10 0,7.76 0,5 Z"
       copytype="single_stretched"
       prop_scale="0.054093225"
       scale_y_rel="false"
       spacing="0"
       normal_offset="0"
       tang_offset="0"
       prop_units="false"
       vertical_pattern="false"
       fuse_tolerance="0" />
    <inkscape:path-effect
       effect="bspline"
       id="path-effect10490-1"
       is_visible="true"
       weight="33.333333"
       steps="2"
       helper_size="0"
       apply_no_weight="true"
       apply_with_weight="true"
       only_selected="false" />
    <inkscape:path-effect
       effect="skeletal"
       id="path-effect10492-5"
       is_visible="true"
       pattern="M 0,5 C 0,2.24 2.24,0 5,0 7.76,0 10,2.24 10,5 10,7.76 7.76,10 5,10 2.24,10 0,7.76 0,5 Z"
       copytype="single_stretched"
       prop_scale="0.054093225"
       scale_y_rel="false"
       spacing="0"
       normal_offset="0"
       tang_offset="0"
       prop_units="false"
       vertical_pattern="false"
       fuse_tolerance="0" />
    <inkscape:path-effect
       effect="bspline"
       id="path-effect10490-4"
       is_visible="true"
       weight="33.333333"
       steps="2"
       helper_size="0"
       apply_no_weight="true"
       apply_with_weight="true"
       only_selected="false" />
    <inkscape:path-effect
       effect="skeletal"
       id="path-effect10492-9"
       is_visible="true"
       pattern="M 0,5 C 0,2.24 2.24,0 5,0 7.76,0 10,2.24 10,5 10,7.76 7.76,10 5,10 2.24,10 0,7.76 0,5 Z"
       copytype="single_stretched"
       prop_scale="0.054093225"
       scale_y_rel="false"
       spacing="0"
       normal_offset="0"
       tang_offset="0"
       prop_units="false"
       vertical_pattern="false"
       fuse_tolerance="0" />
    <inkscape:path-effect
       effect="bspline"
       id="path-effect10490-9"
       is_visible="true"
       weight="33.333333"
       steps="2"
       helper_size="0"
       apply_no_weight="true"
       apply_with_weight="true"
       only_selected="false" />
    <inkscape:path-effect
       effect="skeletal"
       id="path-effect10492-17"
       is_visible="true"
       pattern="M 0,5 C 0,2.24 2.24,0 5,0 7.76,0 10,2.24 10,5 10,7.76 7.76,10 5,10 2.24,10 0,7.76 0,5 Z"
       copytype="single_stretched"
       prop_scale="0.054093225"
       scale_y_rel="false"
       spacing="0"
       normal_offset="0"
       tang_offset="0"
       prop_units="false"
       vertical_pattern="false"
       fuse_tolerance="0" />
    <inkscape:path-effect
       effect="bspline"
       id="path-effect10490-11"
       is_visible="true"
       weight="33.333333"
       steps="2"
       helper_size="0"
       apply_no_weight="true"
       apply_with_weight="true"
       only_selected="false" />
    <inkscape:path-effect
       effect="skeletal"
       id="path-effect10492-59"
       is_visible="true"
       pattern="M 0,5 C 0,2.24 2.24,0 5,0 7.76,0 10,2.24 10,5 10,7.76 7.76,10 5,10 2.24,10 0,7.76 0,5 Z"
       copytype="single_stretched"
       prop_scale="0.054093225"
       scale_y_rel="false"
       spacing="0"
       normal_offset="0"
       tang_offset="0"
       prop_units="false"
       vertical_pattern="false"
       fuse_tolerance="0" />
    <inkscape:path-effect
       effect="spiro"
       id="path-effect918-3"
       is_visible="true" />
    <inkscape:path-effect
       effect="skeletal"
       id="path-effect920-6"
       is_visible="true"
       pattern="M 0,5 C 0,2.24 2.24,0 5,0 7.76,0 10,2.24 10,5 10,7.76 7.76,10 5,10 2.24,10 0,7.76 0,5 Z"
       copytype="single_stretched"
       prop_scale="0.091463394"
       scale_y_rel="false"
       spacing="0"
       normal_offset="0"
       tang_offset="0"
       prop_units="false"
       vertical_pattern="false"
       fuse_tolerance="0" />
  </defs>
  <sodipodi:namedview
     id="base"
     pagecolor="#ffffff"
     bordercolor="#666666"
     borderopacity="1.0"
     inkscape:pageopacity="0.0"
     inkscape:pageshadow="2"
     inkscape:zoom="0.98994952"
     inkscape:cx="14.499763"
     inkscape:cy="324.08116"
     inkscape:document-units="mm"
     inkscape:current-layer="layer5"
     showgrid="false"
     inkscape:window-width="1920"
     inkscape:window-height="1016"
     inkscape:window-x="0"
     inkscape:window-y="27"
     inkscape:window-maximized="1"
     inkscape:document-rotation="0"
     inkscape:snap-others="false"
     inkscape:object-nodes="false"
     inkscape:snap-nodes="false" />
  <metadata
     id="metadata5577">
    <rdf:RDF>
      <cc:Work
         rdf:about="">
        <dc:format>image/svg+xml</dc:format>
        <dc:type
           rdf:resource="http://purl.org/dc/dcmitype/StillImage" />
        <dc:title />
      </cc:Work>
    </rdf:RDF>
  </metadata>
  <g
     style="display:none"
     inkscape:label="Source symbole réseau décentralisé"
     id="g898"
     inkscape:groupmode="layer"
     sodipodi:insensitive="true">
    <g
       transform="matrix(0.13229167,0,0,0.13229167,-5.3898644,-20.680979)"
       id="g896"
       style="display:inline;filter:url(#filter4707);enable-background:new">
      <circle
         r="18.897636"
         style="opacity:1;fill:#000000;fill-opacity:0.58823529;stroke:none;stroke-width:19.11594391;stroke-miterlimit:4;stroke-dasharray:none;stroke-opacity:0.58823529"
         id="circle870"
         cy="658.9682"
         cx="809.08154" />
      <circle
         style="display:inline;opacity:1;fill:#000000;fill-opacity:0.58823529;stroke:none;stroke-width:22.9391346;stroke-miterlimit:4;stroke-dasharray:none;stroke-opacity:0.58823529;enable-background:new"
         id="circle872"
         cy="671.25568"
         cx="683.66809"
         r="22.677164" />
      <circle
         style="display:inline;opacity:1;fill:#000000;fill-opacity:0.58823529;stroke:none;stroke-width:26.76232529;stroke-miterlimit:4;stroke-dasharray:none;stroke-opacity:0.58823529;enable-background:new"
         id="circle874"
         cy="728.17908"
         cx="762.37891"
         r="26.456692" />
      <circle
         style="display:inline;opacity:1;fill:#000000;fill-opacity:0.58823529;stroke:none;stroke-width:22.9391346;stroke-miterlimit:4;stroke-dasharray:none;stroke-opacity:0.58823529;enable-background:new"
         id="circle876"
         cy="667.67291"
         cx="872.17084"
         r="22.677164" />
      <circle
         style="display:inline;opacity:1;fill:#000000;fill-opacity:0.58823529;stroke:none;stroke-width:26.76232529;stroke-miterlimit:4;stroke-dasharray:none;stroke-opacity:0.58823529;enable-background:new"
         id="circle878"
         cy="567.67285"
         cx="701.09943"
         r="26.456692" />
      <circle
         style="display:inline;opacity:1;fill:#000000;fill-opacity:0.58823529;stroke:none;stroke-width:26.76232529;stroke-miterlimit:4;stroke-dasharray:none;stroke-opacity:0.58823529;enable-background:new"
         id="circle880"
         cy="562.67285"
         cx="867.88507"
         r="26.456692" />
      <path
         sodipodi:nodetypes="cc"
         inkscape:connector-curvature="0"
         id="path882"
         d="m 868.90886,588.34654 2.38085,57.54619"
         style="fill:none;stroke:#000000;stroke-width:12.09448814;stroke-linecap:butt;stroke-linejoin:miter;stroke-miterlimit:4;stroke-dasharray:none;stroke-opacity:0.58823529" />
      <path
         sodipodi:nodetypes="cc"
         inkscape:connector-curvature="0"
         id="path884"
         d="m 784.9349,715.6604 68.1179,-37.43219"
         style="fill:none;stroke:#000000;stroke-width:12.09448814;stroke-linecap:butt;stroke-linejoin:miter;stroke-miterlimit:4;stroke-dasharray:none;stroke-opacity:0.58823529" />
      <circle
         transform="matrix(1.9999999,0,0,1.9999999,765.41604,518.06096)"
         r="9.4488182"
         style="display:inline;opacity:1;fill:#000000;fill-opacity:0.58823529;stroke:none;stroke-width:9.55797195;stroke-miterlimit:4;stroke-dasharray:none;stroke-opacity:0.58823529;filter:url(#filter4707);enable-background:new"
         id="circle886"
         cy="9.4488182"
         cx="9.4488182" />
      <path
         sodipodi:nodetypes="cc"
         inkscape:connector-curvature="0"
         id="path888"
         d="m 794.15837,551.77549 66.17609,97.69557"
         style="fill:none;stroke:#000000;stroke-width:12.8503933;stroke-linecap:butt;stroke-linejoin:miter;stroke-miterlimit:4;stroke-dasharray:none;stroke-opacity:0.58823529" />
      <path
         sodipodi:nodetypes="cc"
         inkscape:connector-curvature="0"
         id="path890"
         d="M 724.93956,558.62219 767.61242,542.8567"
         style="fill:none;stroke:#000000;stroke-width:12.8503933;stroke-linecap:butt;stroke-linejoin:miter;stroke-miterlimit:4;stroke-dasharray:none;stroke-opacity:0.58823529" />
      <path
         sodipodi:nodetypes="cc"
         inkscape:connector-curvature="0"
         id="path892"
         d="m 697.2202,654.38333 76.99542,-102.9832"
         style="fill:none;stroke:#000000;stroke-width:12.8503933;stroke-linecap:butt;stroke-linejoin:miter;stroke-miterlimit:4;stroke-dasharray:none;stroke-opacity:0.58823529" />
      <path
         sodipodi:nodetypes="cc"
         inkscape:connector-curvature="0"
         id="path894"
         d="m 850.7313,664.63564 -24.12841,-3.45712"
         style="opacity:1;fill:none;stroke:#000000;stroke-width:12.8503933;stroke-linecap:butt;stroke-linejoin:miter;stroke-miterlimit:4;stroke-dasharray:none;stroke-opacity:0.58823529" />
    </g>
  </g>
  <g
     inkscape:groupmode="layer"
     id="layer3"
     inkscape:label="Fond blanc"
     style="display:none">
    <rect
       style="fill:#ffffff;fill-opacity:1;stroke:none;stroke-width:0.60956234;stroke-opacity:0.58823529"
       id="rect216"
       width="180"
       height="180"
       x="0"
       y="1.6666668e-07" />
  </g>
  <g
     style="display:inline"
     inkscape:label="picasoft"
     id="g4769"
     inkscape:groupmode="layer" />
  <g
     inkscape:groupmode="layer"
     id="layer1"
     inkscape:label="picasoft.net"
     style="display:none">
    <text
       id="text4668"
       y="153.0724"
       x="19.196852"
       style="font-style:normal;font-variant:normal;font-weight:normal;font-stretch:normal;font-size:10.58333302px;line-height:6.61458349px;font-family:'Montserrat Alternates';-inkscape-font-specification:'Montserrat Alternates';letter-spacing:0px;word-spacing:0px;display:inline;fill:#333333;fill-opacity:1;stroke:none;stroke-width:0.26458332;enable-background:new"
       xml:space="preserve"><tspan
         style="font-style:normal;font-variant:normal;font-weight:normal;font-stretch:normal;font-size:25.39999962px;font-family:Comfortaa;-inkscape-font-specification:Comfortaa;fill:#333333;fill-opacity:1;stroke-width:0.26458332"
         y="153.0724"
         x="19.196852"
         id="tspan4666"
         sodipodi:role="line">pica<tspan
   style="fill:#117f7f;fill-opacity:1"
   id="tspan4653">soft</tspan><tspan
   id="tspan886"
   style="font-size:16.93333244px;fill:#333333;fill-opacity:1">.net</tspan></tspan></text>
  </g>
  <g
     inkscape:groupmode="layer"
     id="layer10"
     inkscape:label="Chaton"
     style="display:inline" />
  <g
     inkscape:groupmode="layer"
     id="layer5"
     inkscape:label="livre"
     style="display:inline">
    <g
       id="g982"
       transform="translate(-2.50597,8.5121828)">
      <path
         sodipodi:nodetypes="csc"
         inkscape:original-d="m 69.01516,83.111665 c 0,0 16.930949,0.3048 18.763977,2.624039 2.304862,2.916227 5.129048,17.373456 5.129048,17.373456"
         inkscape:path-effect="#path-effect81-7-0"
         inkscape:connector-curvature="0"
         id="path4670"
         d="m 69.015209,83.111666 c 0.03133,-0.615271 3.537745,-0.978126 8.804873,-1.016569 1.911624,0.04462 4.216154,0.175588 6.580278,0.585521 0.815679,0.138498 1.711581,0.32992 2.634368,0.653292 0.364761,0.07244 0.853392,0.276055 1.388553,0.683233 0.232174,0.17665 0.471645,0.390536 0.712156,0.646599 0.529774,0.698664 0.861501,1.382016 1.094881,1.959861 l 0,0 c 0.369109,0.862869 0.659774,1.717103 0.905951,2.521922 l 0,2e-6 c 0.660569,2.152407 1.11312,4.250039 1.432135,6.016057 l 0,0 c 0.399595,2.206251 0.618343,4.094868 0.683907,5.451686 l 0,0 c 0.03617,0.74782 0.02648,1.34542 -0.02757,1.76882 l 0,0 c -0.0279,0.21855 -0.06755,0.39042 -0.11899,0.51247 l 0,0 c -0.02605,0.0619 -0.05508,0.11097 -0.08716,0.1467 l 0,0 c 0,0 -10e-7,0 -10e-7,0 -0.05417,0.0254 -0.08186,0.0421 -0.09596,0.0526 0,0 -1e-6,0 -1e-6,0 -0.01368,0.0102 -0.01443,0.0146 -0.01444,0.0153 0,0 0,0 0,0 0,0 0,0 0,0 0,0 0,0 0,0 0,0 0,0 0,0 0,0 0,0 0,0 0,0 0,0 0,0 -1e-6,8e-5 -5e-6,6e-5 -5e-6,6e-5 0,0 5e-6,2e-5 -2.6e-5,-5e-5 0,0 0,0 0,0 0,0 0,0 0,0 0,0 0,0 0,0 0,0 0,0 0,0 0,0 0,0 0,0 0,0 0,0 0,0 -2.75e-4,-6.6e-4 -0.0026,-0.004 -0.01913,-0.009 0,0 -10e-7,0 -10e-7,0 -0.01702,-0.004 -0.04896,-0.009 -0.108746,-0.0124 0,0 -1e-6,0 -1e-6,0 l 0,0 c -0.04319,-0.0207 -0.08871,-0.0547 -0.136399,-0.1014 l 0,0 c -0.0941,-0.0923 -0.196981,-0.23464 -0.307856,-0.42338 l 0,0 c -0.214723,-0.36552 -0.460213,-0.90615 -0.73269,-1.59584 l 0,0 c -0.50578,-1.280228 -1.079002,-3.005284 -1.762528,-5.124031 l 0,0 c -0.520865,-1.613406 -1.181328,-3.72737 -1.875247,-5.639748 l -10e-7,-2e-6 C 87.695754,89.462201 87.412236,88.7125 87.090205,88.010809 l 0,0 c -0.246532,-0.508517 -0.440856,-0.944736 -0.667368,-1.203143 0.04555,0.0095 0.05379,0.01543 0.02971,0.01193 -0.05638,-0.0082 -0.278761,-0.06597 -0.590322,-0.237992 -0.633542,-0.238464 -1.358871,-0.403779 -2.103773,-0.565589 -2.063966,-0.441152 -4.327426,-0.743026 -6.132638,-1.001009 -5.19467,-0.57088 -8.641925,-1.288334 -8.61061,-1.903342 z"
         style="display:inline;fill:#ff6600;fill-opacity:1;stroke:none;stroke-width:0.26458332px;stroke-linecap:butt;stroke-linejoin:miter;stroke-opacity:1;enable-background:new" />
      <path
         id="circle4819-5"
         d="m 98.967983,47.853917 a 2.4999998,2.4999998 0 0 0 -2.499591,2.494941 l -0.004,-0.01188 -5.635826,2.082043 a 3.4999999,3.4999999 0 0 0 -2.868578,-1.501714 3.4999999,3.4999999 0 0 0 -3.500049,3.500046 3.4999999,3.4999999 0 0 0 3.500049,3.500043 3.4999999,3.4999999 0 0 0 3.499517,-3.500043 3.4999999,3.4999999 0 0 0 -0.0284,-0.408247 l 5.299935,-1.958017 -9.939954,13.294794 a 2.9999998,2.9999998 0 0 0 -1.137399,-0.225309 2.9999998,2.9999998 0 0 0 -2.999827,2.999817 2.9999998,2.9999998 0 0 0 2.999827,3.000332 2.9999998,2.9999998 0 0 0 2.999809,-3.000332 2.9999998,2.9999998 0 0 0 -0.574119,-1.759067 l 0.0481,0.03617 10.185932,-13.623975 -0.01961,-0.01447 a 2.4999998,2.4999998 0 0 0 0.67437,0.09508 2.4999998,2.4999998 0 0 0 0.625808,-0.08113 l -0.0269,0.0181 8.743653,12.907737 a 2.9999998,2.9999998 0 0 0 -0.44598,0.702803 l -3.1812,-0.455788 -10e-4,0.0083 a 2.4999998,2.4999998 0 0 0 -2.43758,-1.959057 2.4999998,2.4999998 0 0 0 -2.500101,2.500106 2.4999998,2.4999998 0 0 0 2.500101,2.500109 2.4999998,2.4999998 0 0 0 2.22312,-1.362707 l 3.15795,0.452683 a 2.9999998,2.9999998 0 0 0 0.0501,0.256318 l -9.010814,4.952151 0.0284,0.05116 a 3.4999999,3.4999999 0 0 0 -2.62723,-1.193724 3.4999999,3.4999999 0 0 0 -3.500036,3.500044 3.4999999,3.4999999 0 0 0 3.500036,3.500046 3.4999999,3.4999999 0 0 0 3.50004,-3.500046 3.4999999,3.4999999 0 0 0 -0.138488,-0.968934 l 0.008,0.01394 9.010812,-4.952151 a 2.9999998,2.9999998 0 0 0 2.14457,0.902272 2.9999998,2.9999998 0 0 0 2.99983,-2.999817 2.9999998,2.9999998 0 0 0 -2.31717,-2.918169 l -0.31419,-7.60009 a 3.4999999,3.4999999 0 0 0 2.56469,-3.372403 3.4999999,3.4999999 0 0 0 -3.50004,-3.500046 3.4999999,3.4999999 0 0 0 -3.50004,3.500046 3.4999999,3.4999999 0 0 0 2.836,3.434932 l 0.31006,7.484298 -8.69452,-12.835906 a 2.4999998,2.4999998 0 0 0 0.49248,-1.48518 2.4999998,2.4999998 0 0 0 -2.500106,-2.500106 z"
         style="display:inline;fill:#ff6600;fill-opacity:1;stroke:none;stroke-width:0.42333335;stroke-linecap:butt;stroke-linejoin:miter;stroke-miterlimit:4;stroke-dasharray:none;stroke-opacity:1"
         inkscape:connector-curvature="0" />
      <g
         id="g949">
        <g
           style="display:inline;enable-background:new"
           id="g4761-7"
           transform="matrix(0.13229167,0,0,0.13229167,-5.3898654,-20.680974)">
          <g
             id="g5083-4"
             style="display:inline"
             transform="translate(160.33913,51.406037)">
            <path
               inkscape:original-d="m 721.7077,455.97731 c 0,0 194.30399,-96 233.472,-65.28"
               inkscape:path-effect="#path-effect4760-0-93-2-6"
               inkscape:connector-curvature="0"
               id="path4996-8"
               d="m 721.7077,455.97731 c -0.0192,-0.0389 -0.0353,-0.0793 -0.0483,-0.12122 -0.0127,-0.0411 -0.0225,-0.0835 -0.0293,-0.12736 -0.0136,-0.0876 -0.0153,-0.18074 -0.005,-0.27935 0,0 0,0 0,0 l 0,0 c 0.02,-0.19698 0.0869,-0.41548 0.19962,-0.65512 0,0 0,0 0,0 l 0,0 c 0.22472,-0.47783 0.63145,-1.03818 1.21273,-1.67608 l 0,0 c 1.15507,-1.26756 2.99435,-2.83465 5.46356,-4.65852 l 0,0 c 4.85816,-3.58845 12.11024,-8.1387 21.34784,-13.29367 l 0,0 c 17.3955,-9.70888 42.01622,-21.69264 70.40992,-32.66242 3.90926,-1.51054 7.89744,-3.00399 11.95359,-4.46669 9.91356,-3.57496 19.56965,-6.72686 29.01776,-9.45461 14.1342,-4.08654 27.04249,-7.00898 39.34897,-8.76983 13.12543,-1.91623 23.90826,-2.21909 33.52515,-0.86895 5.24004,0.7258 9.55564,1.9855 13.05227,3.6034 6.9998,3.19054 8.76766,7.20162 8.0235,8.15042 -0.80167,1.02213 -4.36843,-0.0893 -10.12825,-0.50788 -3.27513,-0.22046 -6.63825,-0.16121 -11.34683,0.23184 -8.90123,0.75303 -17.352,2.46791 -29.92108,5.63875 -11.53165,2.95359 -23.07363,6.49516 -36.80457,11.05662 -9.07146,3.01806 -18.25854,6.2282 -27.9816,9.73497 -3.95376,1.42599 -7.86828,2.85483 -11.71979,4.27014 -28.04848,10.30862 -53.05727,20.005 -71.74067,26.61508 l 0,0 c -9.85041,3.48536 -17.96857,6.13676 -23.75382,7.61985 l 0,0 c -2.94997,0.75626 -5.31335,1.21412 -7.01155,1.33369 l 0,0 c -0.85598,0.0603 -1.54533,0.0346 -2.05812,-0.0815 l 0,0 c 0,0 0,0 0,0 -0.2573,-0.0582 -0.47047,-0.13943 -0.63814,-0.2439 l 0,0 c 0,0 0,0 0,0 -0.084,-0.0523 -0.15668,-0.11055 -0.21778,-0.17471 -0.0306,-0.0321 -0.0583,-0.0657 -0.0831,-0.10084 -0.0253,-0.0358 -0.0475,-0.0732 -0.0667,-0.11211 z"
               style="display:inline;fill:#000000;stroke:none;stroke-width:2px;stroke-linecap:butt;stroke-linejoin:miter;stroke-opacity:1"
               inkscape:export-xdpi="96"
               inkscape:export-ydpi="96" />
            <path
               inkscape:original-d="m 793.1317,528.93731 c 0,0 153.6,-105.216 159.744,-129.792"
               inkscape:path-effect="#path-effect4764-7-6-1-2"
               inkscape:connector-curvature="0"
               id="path4998-5"
               d="m 793.1317,528.93731 c -1.55436,-2.22622 6.22749,-10.66464 20.09419,-22.54478 0,0 0,0 0,0 12.96326,-11.24173 31.02058,-25.52025 51.50168,-41.11985 2.07263,-1.57862 4.16684,-3.16829 6.28233,-4.76989 7.66043,-5.7996 15.64529,-11.78909 22.66089,-17.03275 9.67583,-7.23393 18.58899,-13.85805 26.38901,-19.717 8.23195,-6.20258 15.07558,-11.37764 20.31498,-15.52348 2.81333,-2.23599 5.08319,-4.03975 6.88015,-5.51827 0,0 0,0 0,0 2.63361,-2.30902 4.82113,-3.7659 5.62077,-3.56598 1.21231,0.30307 1.76625,3.02371 0.009,7.44813 0,-10e-6 0,0 0,0 -0.99296,2.60472 -2.5455,5.45294 -4.76107,8.73081 -4.21401,6.25532 -9.83935,12.77844 -17.52739,20.50218 -7.20817,7.25215 -15.46252,14.73838 -24.98821,22.71628 -7.04185,5.89867 -14.55539,11.87188 -22.5254,17.90584 -2.14087,1.62081 -4.27218,3.21385 -6.38932,4.77761 -20.88672,15.42739 -40.52598,28.11492 -55.44,36.59141 0,0 0,10e-6 0,10e-6 -15.96206,8.94632 -26.56665,13.34615 -28.12117,11.11973 z"
               style="display:inline;fill:#000000;stroke:none;stroke-width:2px;stroke-linecap:butt;stroke-linejoin:miter;stroke-opacity:1"
               inkscape:export-xdpi="96"
               inkscape:export-ydpi="96" />
            <path
               sodipodi:nodetypes="cc"
               inkscape:original-d="m 784.6837,533.54531 c 0,0 88.94823,198.0868 -55.43576,360.9028"
               inkscape:path-effect="#path-effect4768-2-0-2-9"
               inkscape:connector-curvature="0"
               id="path5000-8"
               d="m 784.6837,533.54531 c 2.03566,-0.70749 8.23514,11.05438 17.15789,31.75954 0,0 0,10e-6 0,10e-6 7.63842,20.77109 15.65135,50.68897 18.5781,87.09425 1.77095,22.11671 1.52821,46.21447 -1.85593,71.31806 -2.28881,16.9784 -5.8426,33.1335 -10.43962,48.34671 0,0 -10e-6,2e-5 -10e-6,2e-5 -12.51318,41.26397 -32.17124,72.94348 -48.4811,93.5921 -16.33199,20.67666 -28.86919,30.14527 -30.39509,28.79211 -1.9353,-1.71621 7.28358,-14.03452 20.2297,-35.80272 12.98237,-21.82916 29.39219,-52.97291 40.03625,-91.95207 0,0 1e-5,-10e-6 1e-5,-10e-6 3.95192,-14.41099 7.08194,-29.62886 9.2338,-45.64329 3.17945,-23.66195 3.87209,-46.44127 3.05417,-67.53553 -1.3293,-34.65322 -6.55709,-63.57202 -10.98334,-84.70943 0,0 0,-10e-6 0,-10e-6 -5.7444,-21.49291 -8.1695,-34.55258 -6.13483,-35.25974 z"
               style="display:inline;fill:#000000;stroke:none;stroke-width:2px;stroke-linecap:butt;stroke-linejoin:miter;stroke-opacity:1"
               inkscape:export-xdpi="96"
               inkscape:export-ydpi="96" />
            <path
               sodipodi:nodetypes="cc"
               inkscape:original-d="m 729.05538,902.28975 c 0,0 -0.27153,104.47075 -105.08173,105.42115"
               inkscape:path-effect="#path-effect4900-6-0-1"
               inkscape:connector-curvature="0"
               id="path5002-2"
               d="m 729.05538,902.28976 c 0.0316,3.3e-4 0.063,0.007 0.0944,0.0209 0.0307,0.0133 0.0612,0.0329 0.0916,0.0588 0,0 0,0 0,0 0.0606,0.0518 0.12012,0.12848 0.17863,0.2299 0,0 0,0 0,0 l 0,0 c 0.11652,0.20249 0.22731,0.50156 0.33037,0.89552 l 0,0 0,0 c 0.20424,0.78078 0.37322,1.91751 0.48139,3.39882 l 0,0 c 0.21076,2.88614 0.18838,7.01209 -0.33099,12.17741 l 0,0 c -0.96031,9.59546 -3.67502,23.16353 -10.48519,37.39469 l 0,0 c -3.25414,6.79654 -7.47182,13.71707 -12.84652,20.22367 -1.28344,1.55271 -2.63068,3.07634 -4.04132,4.56458 -4.83872,5.10489 -10.10751,9.4609 -15.59323,13.05754 -9.24552,6.05001 -18.80745,9.77601 -27.37159,11.95931 -21.5573,5.4866 -35.58271,2.1609 -35.58924,1.44 -0.0131,-1.4447 14.17189,-1.6237 33.61559,-8.16253 7.81384,-2.62466 16.45413,-6.47867 24.68109,-12.17466 4.89405,-3.38138 9.62133,-7.39421 14.01824,-12.0333 1.28218,-1.35281 2.51239,-2.73375 3.69033,-4.1375 4.93949,-5.88226 8.96401,-12.16704 12.22962,-18.35575 l 0,0 c 6.82954,-12.93705 10.44317,-25.62533 12.63655,-34.63378 l 0,0 c 1.17943,-4.85446 1.97254,-8.78424 2.59979,-11.52675 l 0,0 c 0.32033,-1.40073 0.60234,-2.50697 0.85789,-3.24403 l 0,0 0,0 c 0.13036,-0.376 0.25673,-0.66407 0.37998,-0.85714 l 0,0 c 0,0 0,0 0,0 0.0621,-0.0976 0.12398,-0.17149 0.18547,-0.22093 0,0 0,0 0,0 0.0309,-0.0248 0.0617,-0.0435 0.0926,-0.056 0.0315,-0.0128 0.063,-0.0191 0.0946,-0.0187 z"
               style="display:inline;fill:#000000;stroke:none;stroke-width:2px;stroke-linecap:butt;stroke-linejoin:miter;stroke-opacity:1"
               inkscape:export-xdpi="96"
               inkscape:export-ydpi="96" />
            <path
               inkscape:original-d="m 621.504,1006.624 c 0,0 -132.288,64.896 -203.328,-94.848"
               inkscape:path-effect="#path-effect4904-2-7-2"
               inkscape:connector-curvature="0"
               id="path5004-6"
               d="m 621.50399,1006.624 c 0.27374,0.7801 -7.54357,4.3343 -21.14111,9.7691 -12.88956,4.0186 -31.98411,7.9156 -54.21286,6.2435 -10.80064,-0.8258 -22.24424,-3.0124 -33.71668,-7.0507 -5.08845,-1.7933 -10.14254,-3.9397 -15.12119,-6.4426 -7.05437,-3.5464 -13.61847,-7.6381 -19.64469,-12.09784 -13.78229,-10.20796 -24.64278,-22.15328 -32.9292,-33.3559 C 423.44085,934.89741 417.86343,911.915 418.176,911.776 c 1.24169,-0.55219 10.21404,21.23101 31.69667,47.95627 8.43054,10.48745 19.12316,21.68835 32.27667,31.18715 5.75037,4.15618 11.97419,7.98864 18.62694,11.33468 4.69591,2.3618 9.449,4.4024 14.22553,6.1249 10.76664,3.8874 21.55133,6.1368 31.77969,7.1899 20.93536,2.1839 39.44633,-0.6094 52.2761,-3.4187 13.85531,-4.199 22.17277,-6.3059 22.44639,-5.5262 z"
               style="display:inline;fill:#000000;stroke:none;stroke-width:2px;stroke-linecap:butt;stroke-linejoin:miter;stroke-opacity:1"
               inkscape:export-xdpi="96"
               inkscape:export-ydpi="96" />
            <path
               sodipodi:nodetypes="cc"
               inkscape:original-d="M 426.24,953.248 C 363.22219,815.46334 177.80569,848.2437 257.78088,518.58857"
               inkscape:path-effect="#path-effect4908-6-3-7"
               inkscape:connector-curvature="0"
               id="path5006-0"
               d="m 426.24,953.248 c -2.10456,0.96255 -11.08748,-17.1097 -33.29942,-40.74827 -9.93173,-10.58133 -21.25669,-20.79736 -36.10559,-32.81948 -11.67506,-9.43999 -24.83718,-19.32778 -38.60716,-30.57864 -12.26026,-10.00101 -25.29863,-21.48481 -37.19438,-34.75577 -11.38491,-12.71485 -21.73474,-27.32257 -29.90482,-43.6932 -0.26995,-0.5409 -0.53708,-1.08286 -0.80137,-1.62585 -9.74506,-20.12471 -15.45514,-41.15093 -18.39462,-61.32581 -4.30895,-29.60247 -3.25229,-58.08241 -0.66991,-82.09329 3.50667,-32.75503 10.1589,-60.9404 15.28475,-78.81283 5.30724,-18.50492 9.65173,-28.59001 11.2334,-28.2063 3.31869,0.80513 -6.76745,43.43399 -10.09758,108.32591 -1.18231,23.27221 -1.21613,50.5197 3.38647,77.78735 3.1295,18.55143 8.49704,37.65778 17.24503,55.58253 0.23496,0.48424 0.47251,0.96778 0.71261,1.45061 7.26165,14.60254 16.52827,27.87544 26.71527,39.65863 10.65261,12.33553 22.7949,23.54862 34.34529,33.68465 13.02693,11.41238 25.82578,21.98028 37.24927,32.36614 14.44777,13.118 25.74981,25.07323 34.97875,37.12183 21.21378,27.71893 25.35355,48.02797 23.92401,48.68179 z"
               style="display:inline;fill:#000000;stroke:none;stroke-width:2px;stroke-linecap:butt;stroke-linejoin:miter;stroke-opacity:1"
               inkscape:export-xdpi="96"
               inkscape:export-ydpi="96" />
            <path
               inkscape:original-d="m 257.28,520.704 c 0,0 -189.696,-637.44 221.952,-84.48"
               inkscape:path-effect="#path-effect4934-1-1-0"
               inkscape:connector-curvature="0"
               id="path5008-6"
               d="m 257.27778,520.69653 c -0.0441,0.0131 -0.0903,0.0187 -0.13861,0.0171 -0.0494,-0.007 -0.10155,-0.0228 -0.15647,-0.0486 0,0 0,0 0,0 -0.10955,-0.0515 -0.22999,-0.14119 -0.36115,-0.26866 0,0 -1e-5,0 -1e-5,0 l 0,0 c -0.261,-0.25374 -0.56391,-0.6567 -0.90726,-1.20596 l 0,0 c -0.67927,-1.08666 -1.51293,-2.73976 -2.48837,-4.94028 l 0,0 c -1.90228,-4.29141 -4.32351,-10.61546 -7.14852,-18.83183 l 0,0 c -5.21399,-15.16417 -11.97147,-37.25341 -18.82747,-64.17155 l 0,0 c -5.893,-23.12928 -12.29163,-51.4028 -17.05886,-81.85143 l 0,0 c -2.03707,-13.00897 -3.8263,-26.7944 -4.97848,-41.00891 l 0,0 c -0.98279,-12.0618 -1.53316,-24.7542 -1.04995,-37.72408 l 0,0 c 0.35884,-10.33111 1.4324,-21.27743 4.26929,-32.26171 l 0,0 c 1.15321,-4.46126 2.70005,-9.02706 4.81988,-13.54331 l 0,0 c 1.81773,-3.90609 4.2107,-7.80759 7.32045,-11.44802 2.83256,-3.30806 6.33547,-6.22404 10.44762,-8.48046 0,0 4e-5,-2e-5 4e-5,-2e-5 4.18957,-2.23439 8.68596,-3.58838 13.22763,-4.07542 0.73591,-0.0753 1.46796,-0.13228 2.19566,-0.17167 4.42088,-0.23929 8.65199,0.17079 12.5798,1.01515 5.75232,1.2139 11.07558,3.1241 15.95177,5.3507 14.06527,6.42036 26.25296,15.20278 37.02935,23.98429 17.1824,13.90717 32.523,29.1712 46.13511,43.67447 21.70041,23.10052 40.93113,46.49872 56.6013,66.52424 0,0 1e-5,2e-5 1e-5,2e-5 43.37885,55.42719 66.50637,93.49339 64.49147,94.99338 -2.8327,2.10878 -30.33208,-32.72554 -76.16558,-85.35524 -1e-5,-10e-6 -1e-5,-10e-6 -2e-5,-2e-5 -16.4431,-18.87894 -36.52563,-41.49321 -58.1865,-63.38178 -13.69703,-13.82924 -28.76928,-28.29236 -45.10076,-41.14356 -10.40409,-8.12945 -21.29224,-15.96423 -32.97189,-21.10032 -3.98689,-1.75184 -7.93565,-3.19958 -11.81005,-3.96488 -2.61994,-0.50183 -5.13833,-0.78854 -7.43284,-0.65036 -0.37783,0.0228 -0.74926,0.057 -1.11384,0.10363 -2.16832,0.2566 -4.23589,0.84453 -5.94454,1.79043 0,0 -2e-5,0 -2e-5,0 -1.73181,0.89464 -3.37785,2.3061 -4.86416,3.97209 -1.68876,1.88602 -3.12025,4.28116 -4.42074,6.92196 l 0,0 c -1.4991,3.0819 -2.6562,6.49534 -3.64032,10.07475 l 0,0 c -2.44933,8.90283 -3.43585,18.47127 -3.96677,28.04135 l 0,0 c -0.63009,11.9313 -0.31491,23.92032 0.36196,35.53943 l 0,0 c 0.80159,13.66234 2.1826,27.093 3.76409,39.8604 l 0,0 c 3.68235,29.72064 8.78091,58.23365 13.14892,81.28626 5.15139,27.1765 9.81623,49.32199 12.89505,65.1343 l 0,0 c 1.64689,8.4579 2.85624,15.14135 3.48743,19.74766 l 0,0 c 0.32506,2.37216 0.50016,4.21443 0.50945,5.48846 l 0,0 c 0.005,0.6453 -0.0331,1.14693 -0.11511,1.50033 l 0,0 c 0,0 0,0 0,0 -0.0412,0.17782 -0.0937,0.31829 -0.15762,0.42086 0,0 0,10e-6 0,10e-6 -0.0321,0.0514 -0.067,0.0934 -0.10481,0.1257 -0.0396,0.0276 -0.0815,0.048 -0.12556,0.0611 z"
               style="display:inline;fill:#000000;stroke:none;stroke-width:2px;stroke-linecap:butt;stroke-linejoin:miter;stroke-opacity:1"
               inkscape:export-xdpi="96"
               inkscape:export-ydpi="96" />
            <path
               inkscape:original-d="m 456.71178,382.00174 c 0,0 140.65202,-20.09316 287.82074,39.64322"
               inkscape:path-effect="#path-effect4938-8-1-9"
               inkscape:connector-curvature="0"
               id="path5010-6"
               d="m 456.71179,382.00174 c -0.11963,-4.1169 36.38598,-8.71117 88.81722,-11.75952 18.11637,0.30178 37.85666,1.64983 58.67608,4.45798 12.18954,1.64414 23.9154,3.67636 35.11549,6.01234 0,0 1e-5,0 1e-5,0 32.21825,6.74378 58.57843,15.75353 77.38552,23.95712 18.55582,8.09398 28.67449,14.88594 27.82641,16.9753 -0.91703,2.25924 -12.63035,-0.49841 -31.81729,-5.1986 -20.09757,-4.92326 -45.05405,-11.05469 -77.0645,-16.65546 0,0 -10e-6,-1e-5 -10e-6,-1e-5 -10.85376,-1.90598 -22.11654,-3.67809 -33.84857,-5.2737 -20.07248,-2.72995 -38.88207,-4.58505 -56.4257,-5.91328 -51.91516,-0.0136 -88.54511,-2.48782 -88.66466,-6.60217 z"
               style="display:inline;fill:#000000;stroke:none;stroke-width:2px;stroke-linecap:butt;stroke-linejoin:miter;stroke-opacity:1"
               inkscape:export-xdpi="96"
               inkscape:export-ydpi="96" />
            <path
               style="fill:#000000;stroke:none;stroke-width:2px;stroke-linecap:butt;stroke-linejoin:miter;stroke-opacity:1"
               d="m 591.74401,958.84801 c 0.0271,-0.0474 0.0576,-0.092 0.0918,-0.13494 0.0331,-0.0414 0.0694,-0.0808 0.109,-0.1182 0.0789,-0.0745 0.17097,-0.1416 0.27538,-0.20068 0,0 0,0 0,0 l 0,0 c 0.20713,-0.11784 0.4654,-0.2075 0.77017,-0.26835 l 0,0 c 0.60383,-0.12058 1.40347,-0.13651 2.37227,-0.062 l 0,0 c 1.891,0.1453 4.52284,0.63394 7.67169,1.29702 l 0,0 c 6.14161,1.28999 14.36015,3.25022 23.93158,4.51564 5.11273,0.66489 10.59553,1.13555 16.24055,1.17043 4.88765,0.0302 9.48846,-0.26845 13.86366,-0.87223 0,0 10e-6,0 10e-6,0 10.02158,-1.33685 18.31822,-4.30802 24.49488,-6.62918 6.11484,-2.29793 10.05469,-3.87475 11.17099,-2.53751 1.01422,1.21494 -0.93825,5.27178 -6.50102,10.15098 -5.53261,4.85273 -14.58492,10.32252 -26.63554,12.98315 0,0 -10e-6,0 -10e-6,0 -5.18793,1.12774 -10.70731,1.72376 -16.46377,1.70303 -6.67342,-0.024 -12.9864,-0.87389 -18.71155,-2.2121 -10.67001,-2.47539 -19.17511,-6.48482 -24.80295,-10.1184 l 0,0 c -2.92572,-1.88711 -5.08129,-3.67483 -6.42182,-5.17964 l 0,0 c -0.68031,-0.76374 -1.14727,-1.44758 -1.39389,-2.03578 l 0,0 c -0.12411,-0.29605 -0.1927,-0.56503 -0.20374,-0.8073 l 0,0 c 0,0 0,0 0,-10e-6 -0.005,-0.12124 0.004,-0.23494 0.0268,-0.34169 0.0117,-0.0534 0.0269,-0.10489 0.0457,-0.15453 0.0195,-0.0514 0.0426,-0.10035 0.0697,-0.1477 z"
               id="path5045-4"
               inkscape:connector-curvature="0"
               inkscape:path-effect="#path-effect5047-7-9-3"
               inkscape:original-d="m 591.744,958.848 c 0,0 56.832,33.024 100.992,-3.84"
               sodipodi:nodetypes="cc"
               inkscape:export-xdpi="96"
               inkscape:export-ydpi="96" />
            <path
               style="fill:#000000;stroke:none;stroke-width:2px;stroke-linecap:butt;stroke-linejoin:miter;stroke-opacity:1"
               d="m 615.29977,985.732 c -0.63974,-2.59351 5.93847,-6.44912 14.68352,-8.60627 8.74505,-2.15716 16.3617,-1.80301 17.00144,0.7905 0.63975,2.59351 -5.93847,6.44912 -14.68352,8.60627 -8.74505,2.15716 -16.3617,1.80301 -17.00144,-0.7905 z"
               id="path5049-6"
               inkscape:connector-curvature="0"
               inkscape:path-effect="#path-effect5051-9-0-6"
               inkscape:original-d="m 615.29977,985.732 31.68496,-7.81577"
               sodipodi:nodetypes="cc"
               inkscape:export-xdpi="96"
               inkscape:export-ydpi="96" />
          </g>
        </g>
        <g
           id="g973"
           style="fill:#ff6600;fill-opacity:1">
          <g
             transform="matrix(0.83768673,-0.01834921,0.01834921,0.83768673,52.8449,13.985048)"
             id="g10605"
             style="display:inline;fill:#ff6600;fill-opacity:1">
            <path
               style="fill:#ff6600;fill-opacity:1;stroke:none;stroke-width:0.26458332px;stroke-linecap:butt;stroke-linejoin:miter;stroke-opacity:1"
               d="m 40.268824,128.4615 c 0.06144,0.0156 -0.125936,0.88231 0.746722,2.03054 0.576779,0.74114 1.213705,1.29776 2.283553,2.19679 1.332286,1.1128 4.18499,3.28405 5.913997,5.63766 0,0 10e-7,0 2e-6,1e-5 1.470478,2.02409 2.374414,4.38067 3.216641,7.19587 0.286446,0.94785 0.569728,1.98603 0.925415,2.92222 0.262266,0.62782 0.478874,1.25751 0.893074,1.5355 0.203883,0.20786 0.628487,0.18913 1.041998,0.0978 0.622504,-0.16515 1.216633,-0.53423 1.865108,-0.93744 1.646556,-1.04503 3.286122,-2.33077 5.22508,-3.37327 3.37001,-1.80797 7.424015,-2.92347 11.659607,-2.76609 1.225353,0.0506 2.379014,0.29378 3.520961,0.51673 0.711926,0.10557 1.388693,0.21009 1.795715,-0.0751 0,0 3e-6,0 3e-6,0 0.744746,-0.38493 1.356323,-1.20152 2.205622,-1.95121 1.147457,-1.03475 2.515348,-1.90688 4.068392,-2.39152 1.892912,-0.5729 3.758717,-0.66175 5.587663,-0.93528 0.242417,-0.0407 0.478111,-0.0766 0.702583,-0.11701 0.417216,-0.0751 0.793001,-0.16584 1.101259,-0.33277 0.145431,-0.10283 0.324686,-0.24866 0.21084,-0.21521 -0.08355,-0.47651 -0.628886,-0.91806 -1.154613,-1.48938 -0.827557,-0.82553 -1.745128,-1.5908 -2.66068,-2.35113 -2.219983,-1.83985 -4.362052,-3.47467 -6.392246,-5.45602 -1.50742,-1.47781 -2.794027,-3.16628 -4.013657,-4.6875 -0.970483,-1.18788 -1.982113,-2.24688 -3.228182,-2.77214 -1.572013,-0.69889 -3.375311,-0.85053 -5.086595,-0.80285 -1.696548,0.0741 -3.294601,0.27314 -4.538352,1.06381 -0.775125,0.45137 -1.281672,1.32848 -1.613751,2.22619 -0.119555,0.34385 -0.231962,0.73899 -0.44585,1.1535 -0.162553,0.3637 -0.524364,0.68109 -1.049835,0.79026 0,0 -6e-6,0 -6e-6,0 -0.616607,0.0351 -1.101673,-0.16366 -1.45024,-0.3236 -0.654809,-0.25608 -1.271067,-0.52518 -1.875604,-0.74583 -2.036289,-0.7441 -4.064097,-1.04355 -5.938491,-0.98722 -3.292613,0.096 -6.229874,0.95955 -8.340311,1.76112 -1.477744,0.56394 -2.51078,1.09026 -3.381243,1.685 -1.421256,0.99444 -1.727764,1.91454 -1.79458,1.89757 -0.09886,-0.0251 0.04632,-1.04601 1.558909,-2.21737 0.85108,-0.67349 1.911637,-1.29362 3.388175,-1.92871 2.1172,-0.9146 5.096535,-1.90049 8.530841,-2.09191 1.986299,-0.10862 4.145724,0.15771 6.322276,0.90598 0.648126,0.22309 1.27893,0.48399 1.912046,0.71851 0.410629,0.12921 0.73507,0.29851 0.942615,0.23865 0,0 2e-6,0 2e-6,0 0.02459,0.0459 0.09476,-0.0814 0.192101,-0.21564 0.142619,-0.26859 0.226192,-0.61292 0.363322,-1.00971 0.347431,-1.063 0.989488,-2.14649 2.053207,-2.85228 1.532522,-0.95635 3.337162,-1.24763 5.116766,-1.3081 1.818639,-0.089 3.802963,0.073 5.649416,0.85129 1.543968,0.6804 2.739405,1.85926 3.752365,3.12284 1.248051,1.52874 2.511983,3.17217 3.933484,4.54191 1.961334,1.89926 4.076694,3.49568 6.331186,5.35686 0.921551,0.75921 1.872091,1.55096 2.761305,2.4324 0.538136,0.4865 1.206067,1.13434 1.524031,2.11731 0.116245,0.87013 -0.303795,1.56551 -0.936828,1.8574 -0.498581,0.24212 -1.001835,0.3787 -1.482967,0.47006 -0.258745,0.0491 -0.510503,0.0851 -0.750239,0.11732 -1.926539,0.29492 -3.722037,0.36548 -5.385669,0.88322 -1.311385,0.39375 -2.507557,1.16325 -3.548324,2.08512 -0.71621,0.65023 -1.403725,1.51545 -2.47164,2.12493 0,0 -6e-6,0 -6e-6,0 -0.954465,0.46147 -1.938136,0.39871 -2.729469,0.20967 -1.160097,-0.22821 -2.240775,-0.4695 -3.310662,-0.51175 -3.960755,-0.17419 -7.803744,0.84902 -11.015888,2.52119 -1.822007,0.946 -3.461043,2.20243 -5.186925,3.26355 -0.65994,0.41391 -1.368945,0.82021 -2.192646,1.04472 -0.64315,0.19329 -1.405112,0.12791 -2.038746,-0.32538 -0.694552,-0.59742 -1.008836,-1.38815 -1.218864,-2.04195 -0.361913,-1.01122 -0.631995,-2.07383 -0.894073,-3.01059 -0.791341,-2.79749 -1.578615,-5.05599 -2.919362,-6.99141 0,0 -2e-6,0 -2e-6,0 -1.521965,-2.22352 -4.325076,-4.54053 -5.589589,-5.7098 -1.019637,-0.93755 -1.67578,-1.59795 -2.211235,-2.40387 -0.992143,-1.4568 -0.426463,-2.23876 -0.448912,-2.24446 z"
               id="path10482"
               inkscape:connector-curvature="0"
               inkscape:path-effect="#path-effect10484;#path-effect10486"
               inkscape:original-d="m 33.408688,128.41698 c 6.147464,2.85061 12.294664,5.70149 18.441599,8.55263 0.17844,6.05772 0.356624,12.11595 0.534537,18.17432 3.207637,-3.38582 6.414733,-6.77109 9.621703,-10.15624 4.543483,-0.71292 9.087429,-1.4257 13.630746,-2.13816 1.336524,0.89058 2.672961,1.95972 4.009043,2.93997 1.425654,-2.4947 2.851139,-4.9893 4.276312,-7.48355 5.255906,0.44513 10.512868,0.89064 15.768901,1.33635 -6.292869,-4.21622 -12.586013,-8.43219 -18.87941,-12.64788 -0.907243,-2.78479 -1.814733,-5.56926 -2.722523,-8.35357 -5.004496,0.22939 -10.008698,0.45903 -15.01399,0.68896 0.534843,2.58353 1.069343,5.16695 1.603617,7.75082 -2.850644,-2.31663 -5.701485,-4.63293 -8.552624,-6.949 -7.572452,2.76155 -15.145009,5.5233 -22.717911,8.28535 z"
               transform="translate(-5.3453904,9.8889723)"
               sodipodi:nodetypes="cccccccccccccc" />
            <path
               style="fill:#ff6600;fill-opacity:1;stroke:none;stroke-width:0.26458332px;stroke-linecap:butt;stroke-linejoin:miter;stroke-opacity:1"
               d="m 57.703907,135.06343 c 0.03269,-0.0335 4.046599,3.34972 8.427553,8.24854 0.105906,0.11845 0.211961,0.23773 0.318184,0.35785 4.497267,5.08556 7.603092,9.62917 7.561665,9.66187 -0.117189,0.0925 -3.496099,-4.24874 -7.966836,-9.30354 -0.105692,-0.1195 -0.211094,-0.23823 -0.316252,-0.35622 -4.341072,-4.87196 -8.126206,-8.50426 -8.024314,-8.6085 z"
               id="path10488"
               inkscape:connector-curvature="0"
               inkscape:path-effect="#path-effect10490;#path-effect10492"
               inkscape:original-d="m 57.703907,135.06343 c 2.7543,2.69166 5.508301,5.38355 8.262071,8.07574 2.682051,3.39725 5.363827,6.79476 8.045327,10.19252"
               sodipodi:nodetypes="ccc" />
            <path
               transform="matrix(0.38970942,-0.66164024,0.63020316,0.39537149,-58.30737,136.62556)"
               style="display:inline;fill:#ff6600;fill-opacity:1;stroke:none;stroke-width:0.26458332px;stroke-linecap:butt;stroke-linejoin:miter;stroke-opacity:1"
               d="m 57.703907,135.06343 c 0.02827,-0.0473 1.206695,0.52975 3.042582,1.64465 1.750951,1.06332 4.414797,2.81114 6.582256,5.22794 0,0 10e-7,0 10e-7,0 0.153565,0.17196 0.305377,0.34704 0.455533,0.52529 2.174295,2.58105 3.755555,5.57547 4.720093,7.51161 1.015582,2.03859 1.560734,3.33134 1.506935,3.35877 -0.07868,0.0401 -0.746911,-1.19234 -1.846731,-3.18026 -1.032161,-1.86563 -2.681449,-4.8417 -4.792981,-7.34204 -0.147187,-0.17429 -0.295741,-0.3455 -0.445798,-0.51369 0,0 -10e-7,0 -10e-7,0 -2.084398,-2.34651 -4.70107,-4.14555 -6.380511,-5.27256 -1.775168,-1.19125 -2.886769,-1.88376 -2.841378,-1.95971 z"
               id="path10488-7"
               inkscape:connector-curvature="0"
               inkscape:path-effect="#path-effect10490;#path-effect10492"
               inkscape:original-d="m 57.703907,135.06343 c 3.352753,2.00358 6.705354,4.00724 10.057887,6.011 2.083881,4.08634 4.166614,8.17124 6.249511,12.25726"
               sodipodi:nodetypes="ccc" />
            <path
               transform="matrix(0.38970942,-0.66164023,0.63020316,0.39537148,-67.829066,125.29569)"
               style="display:inline;fill:#ff6600;fill-opacity:1;stroke:none;stroke-width:0.26458332px;stroke-linecap:butt;stroke-linejoin:miter;stroke-opacity:1"
               d="m 57.703907,135.06343 c 0.02827,-0.0473 1.206695,0.52975 3.042582,1.64465 1.750951,1.06332 4.414797,2.81114 6.582256,5.22794 0,0 10e-7,0 10e-7,0 0.153565,0.17196 0.305377,0.34704 0.455533,0.52529 2.174295,2.58105 3.755555,5.57547 4.720093,7.51161 1.015582,2.03859 1.560734,3.33134 1.506935,3.35877 -0.07868,0.0401 -0.746911,-1.19234 -1.846731,-3.18026 -1.032161,-1.86563 -2.681449,-4.8417 -4.792981,-7.34204 -0.147187,-0.17429 -0.295741,-0.3455 -0.445798,-0.51369 0,0 -10e-7,0 -10e-7,0 -2.084398,-2.34651 -4.70107,-4.14555 -6.380511,-5.27256 -1.775168,-1.19125 -2.886769,-1.88376 -2.841378,-1.95971 z"
               id="path10488-7-2"
               inkscape:connector-curvature="0"
               inkscape:path-effect="#path-effect10490;#path-effect10492"
               inkscape:original-d="m 57.703907,135.06343 c 3.352753,2.00358 6.705354,4.00724 10.057887,6.011 2.083881,4.08634 4.166614,8.17124 6.249511,12.25726"
               sodipodi:nodetypes="ccc" />
            <path
               transform="matrix(0.32511253,-0.55196902,0.52574285,0.32983606,-43.778841,132.83084)"
               style="display:inline;fill:#ff6600;fill-opacity:1;stroke:none;stroke-width:0.26458332px;stroke-linecap:butt;stroke-linejoin:miter;stroke-opacity:1"
               d="m 57.703907,135.06343 c 0.02827,-0.0473 1.206695,0.52975 3.042582,1.64465 1.750951,1.06332 4.414797,2.81114 6.582256,5.22794 0,0 10e-7,0 10e-7,0 0.153565,0.17196 0.305377,0.34704 0.455533,0.52529 2.174295,2.58105 3.755555,5.57547 4.720093,7.51161 1.015582,2.03859 1.560734,3.33134 1.506935,3.35877 -0.07868,0.0401 -0.746911,-1.19234 -1.846731,-3.18026 -1.032161,-1.86563 -2.681449,-4.8417 -4.792981,-7.34204 -0.147187,-0.17429 -0.295741,-0.3455 -0.445798,-0.51369 0,0 -10e-7,0 -10e-7,0 -2.084398,-2.34651 -4.70107,-4.14555 -6.380511,-5.27256 -1.775168,-1.19125 -2.886769,-1.88376 -2.841378,-1.95971 z"
               id="path10488-7-6"
               inkscape:connector-curvature="0"
               inkscape:path-effect="#path-effect10490;#path-effect10492"
               inkscape:original-d="m 57.703907,135.06343 c 3.352753,2.00358 6.705354,4.00724 10.057887,6.011 2.083881,4.08634 4.166614,8.17124 6.249511,12.25726"
               sodipodi:nodetypes="ccc" />
            <path
               transform="matrix(0.25709486,-0.61777174,0.41575077,0.36915731,1.1274921,133.18742)"
               style="display:inline;fill:#ff6600;fill-opacity:1;stroke:none;stroke-width:0.26458332px;stroke-linecap:butt;stroke-linejoin:miter;stroke-opacity:1"
               d="m 57.703907,135.06343 c 0.02827,-0.0473 1.206695,0.52975 3.042582,1.64465 1.750951,1.06332 4.414797,2.81114 6.582256,5.22794 0,0 10e-7,0 10e-7,0 0.153565,0.17196 0.305377,0.34704 0.455533,0.52529 2.174295,2.58105 3.755555,5.57547 4.720093,7.51161 1.015582,2.03859 1.560734,3.33134 1.506935,3.35877 -0.07868,0.0401 -0.746911,-1.19234 -1.846731,-3.18026 -1.032161,-1.86563 -2.681449,-4.8417 -4.792981,-7.34204 -0.147187,-0.17429 -0.295741,-0.3455 -0.445798,-0.51369 0,0 -10e-7,0 -10e-7,0 -2.084398,-2.34651 -4.70107,-4.14555 -6.380511,-5.27256 -1.775168,-1.19125 -2.886769,-1.88376 -2.841378,-1.95971 z"
               id="path10488-7-9"
               inkscape:connector-curvature="0"
               inkscape:path-effect="#path-effect10490;#path-effect10492"
               inkscape:original-d="m 57.703907,135.06343 c 3.352753,2.00358 6.705354,4.00724 10.057887,6.011 2.083881,4.08634 4.166614,8.17124 6.249511,12.25726"
               sodipodi:nodetypes="ccc" />
            <path
               transform="matrix(0.23377801,-0.50810053,0.37804486,0.30362189,1.3850285,129.56408)"
               style="display:inline;fill:#ff6600;fill-opacity:1;stroke:none;stroke-width:0.26458332px;stroke-linecap:butt;stroke-linejoin:miter;stroke-opacity:1"
               d="m 57.703907,135.06343 c 0.02827,-0.0473 1.206695,0.52975 3.042582,1.64465 1.750951,1.06332 4.414797,2.81114 6.582256,5.22794 0,0 10e-7,0 10e-7,0 0.153565,0.17196 0.305377,0.34704 0.455533,0.52529 2.174295,2.58105 3.755555,5.57547 4.720093,7.51161 1.015582,2.03859 1.560734,3.33134 1.506935,3.35877 -0.07868,0.0401 -0.746911,-1.19234 -1.846731,-3.18026 -1.032161,-1.86563 -2.681449,-4.8417 -4.792981,-7.34204 -0.147187,-0.17429 -0.295741,-0.3455 -0.445798,-0.51369 0,0 -10e-7,0 -10e-7,0 -2.084398,-2.34651 -4.70107,-4.14555 -6.380511,-5.27256 -1.775168,-1.19125 -2.886769,-1.88376 -2.841378,-1.95971 z"
               id="path10488-7-9-7"
               inkscape:connector-curvature="0"
               inkscape:path-effect="#path-effect10490;#path-effect10492"
               inkscape:original-d="m 57.703907,135.06343 c 3.352753,2.00358 6.705354,4.00724 10.057887,6.011 2.083881,4.08634 4.166614,8.17124 6.249511,12.25726"
               sodipodi:nodetypes="ccc" />
            <path
               transform="matrix(0.21629038,-0.48616629,0.34976542,0.2905148,1.9373249,124.32255)"
               style="display:inline;fill:#ff6600;fill-opacity:1;stroke:none;stroke-width:0.26458332px;stroke-linecap:butt;stroke-linejoin:miter;stroke-opacity:1"
               d="m 57.703907,135.06343 c 0.02827,-0.0473 1.206695,0.52975 3.042582,1.64465 1.750951,1.06332 4.414797,2.81114 6.582256,5.22794 0,0 10e-7,0 10e-7,0 0.153565,0.17196 0.305377,0.34704 0.455533,0.52529 2.174295,2.58105 3.755555,5.57547 4.720093,7.51161 1.015582,2.03859 1.560734,3.33134 1.506935,3.35877 -0.07868,0.0401 -0.746911,-1.19234 -1.846731,-3.18026 -1.032161,-1.86563 -2.681449,-4.8417 -4.792981,-7.34204 -0.147187,-0.17429 -0.295741,-0.3455 -0.445798,-0.51369 0,0 -10e-7,0 -10e-7,0 -2.084398,-2.34651 -4.70107,-4.14555 -6.380511,-5.27256 -1.775168,-1.19125 -2.886769,-1.88376 -2.841378,-1.95971 z"
               id="path10488-7-9-77"
               inkscape:connector-curvature="0"
               inkscape:path-effect="#path-effect10490;#path-effect10492"
               inkscape:original-d="m 57.703907,135.06343 c 3.352753,2.00358 6.705354,4.00724 10.057887,6.011 2.083881,4.08634 4.166614,8.17124 6.249511,12.25726"
               sodipodi:nodetypes="ccc" />
          </g>
          <g
             id="g958"
             style="fill:#ff6600;fill-opacity:1">
            <path
               style="fill:#ff6600;fill-opacity:1;stroke:none;stroke-width:0.26458332px;stroke-linecap:butt;stroke-linejoin:miter;stroke-opacity:1"
               d="m 97.707801,146.90523 c 0.08541,-0.0254 0.267435,0.44695 0.678721,1.2186 0.108345,0.20214 0.243002,0.44673 0.403084,0.65258 0.138766,0.17725 0.309921,0.35423 0.511431,0.4678 0.245246,0.14518 0.562209,0.2121 0.899453,0.191 0,0 0,0 0,0 0.30312,-0.0192 0.61685,-0.12015 0.93036,-0.28123 0.59053,-0.29907 1.04406,-0.77619 1.67294,-1.34736 0.95466,-0.87905 2.0565,-1.72736 3.30727,-2.49379 5.80399,-3.55646 11.21163,-3.19004 11.22027,-2.99783 0.0113,0.25218 -5.38488,0.49579 -10.74247,3.77769 -1.20249,0.73661 -2.27077,1.5338 -3.21373,2.35251 -0.61462,0.54138 -1.17076,1.0512 -1.90911,1.39826 -0.40092,0.18624 -0.82441,0.28819 -1.24341,0.29185 0,0 0,0 0,0 -0.47151,0.004 -0.910488,-0.13571 -1.257097,-0.37612 -0.277944,-0.19886 -0.477682,-0.44633 -0.619186,-0.68145 -0.16502,-0.27271 -0.276588,-0.55198 -0.357269,-0.77851 -0.307699,-0.85793 -0.345519,-1.37492 -0.281257,-1.394 z"
               id="path916"
               inkscape:connector-curvature="0"
               inkscape:path-effect="#path-effect918;#path-effect920"
               inkscape:original-d="m 97.707801,146.90523 c -0.579347,-0.93518 -0.05429,0.81608 0.479989,1.3063 0.534273,0.49026 0.901202,0.84446 0.945485,1.29017 0.04428,0.44572 3.733715,-1.28696 3.956185,-1.37579 0.22246,-0.0888 8.31765,-3.22757 14.24186,-5.81091"
               transform="matrix(1.163931,0,0,1.0229265,-19.234256,-3.261061)"
               sodipodi:nodetypes="ccccc" />
            <path
               style="fill:#ff6600;fill-opacity:1;stroke:none;stroke-width:0.26458332px;stroke-linecap:butt;stroke-linejoin:miter;stroke-opacity:1"
               d="m 98.031833,148.41928 c 0.03437,-0.01 0.113476,0.0967 0.186258,0.32918 0.06961,0.22101 0.09323,0.56473 0.235811,0.88517 0.05014,0.11359 0.117403,0.23011 0.207928,0.30854 0,0 0,0 0,0 0.07891,0.0676 0.178597,0.12259 0.268609,0.12302 0.08967,0.0114 0.198294,-0.0326 0.315429,-0.0975 0.111223,-0.0652 0.214583,-0.16466 0.351478,-0.28565 1.609634,-1.45338 3.910654,-3.18708 6.877954,-4.72101 5.82306,-3.01019 11.0657,-3.52745 11.1078,-3.28953 0.044,0.24858 -5.09022,1.20863 -10.68776,4.1021 -2.91448,1.50655 -5.17951,3.08991 -6.88979,4.39884 -0.141739,0.11095 -0.29372,0.22513 -0.48062,0.31886 -0.202155,0.10524 -0.439494,0.14784 -0.675933,0.10966 -0.237129,-0.0493 -0.420759,-0.17759 -0.543711,-0.32696 0,0 -10e-7,0 -10e-7,0 -0.13732,-0.16646 -0.212909,-0.34779 -0.252506,-0.50963 -0.08679,-0.35949 -0.05867,-0.85738 -0.05766,-0.98126 0.0014,-0.22625 -0.0035,-0.35268 0.03672,-0.36384 z"
               id="path916-7"
               inkscape:connector-curvature="0"
               inkscape:path-effect="#path-effect918;#path-effect920"
               inkscape:original-d="m 98.031833,148.41928 c -0.579347,-0.93518 -0.459503,-0.14375 0.07477,0.34651 0.534273,0.49026 0.738832,1.12158 0.783115,1.56729 0.04428,0.44572 0.68927,-0.317 0.911729,-0.40583 0.222463,-0.0888 11.857443,-5.6724 17.781653,-8.25574"
               transform="matrix(0.18458938,0.95907405,-0.88227556,0.15498479,198.74448,14.628385)"
               sodipodi:nodetypes="ccccc" />
            <path
               style="fill:#ff6600;fill-opacity:1;stroke:none;stroke-width:0.26458332px;stroke-linecap:butt;stroke-linejoin:miter;stroke-opacity:1"
               d="m 118.53403,141.78046 c -0.0996,-0.14775 2.56266,-2.43806 6.93102,-3.05897 0.71908,-0.10221 1.41636,-0.14935 2.08305,-0.15135 0.56508,-0.004 1.00492,0.0225 1.44455,-0.0619 0.23101,-0.0434 0.43999,-0.10832 0.6212,-0.20411 0.19769,-0.10479 0.36198,-0.23741 0.47739,-0.39132 0.2304,-0.29916 0.27976,-0.68141 0.22922,-0.96784 0,0 0,0 0,0 -0.11158,-0.65311 -0.595,-0.90744 -0.56112,-0.97759 -0.0321,0.0665 0.62587,-0.12441 0.96863,0.86763 0,0 0,0 0,0 0.12857,0.37698 0.13676,0.90789 -0.16463,1.39644 -0.15296,0.2437 -0.36912,0.45777 -0.6342,0.61969 -0.24102,0.14757 -0.50957,0.25371 -0.79401,0.3209 -0.53383,0.12438 -1.03521,0.1249 -1.57449,0.13929 -0.63678,0.0201 -1.30049,0.0747 -1.98723,0.17234 -4.02728,0.57278 -6.92062,2.47302 -7.03938,2.29682 z"
               id="path949"
               inkscape:connector-curvature="0"
               inkscape:path-effect="#path-effect951;#path-effect953"
               inkscape:original-d="m 118.53403,141.78046 c 3.89795,-0.98026 5.12293,-1.86001 9.02034,-2.83974 3.89742,-0.97972 2.2832,-0.57935 2.77292,-0.86862 0.48973,-0.28928 -0.0331,-1.57048 -0.56794,-2.10475"
               sodipodi:nodetypes="cccc" />
          </g>
        </g>
      </g>
    </g>
  </g>
</svg>
