<?xml version="1.0" encoding="UTF-8" standalone="no"?>
<!-- Created with Inkscape (http://www.inkscape.org/) -->
<svg xmlns:dc="http://purl.org/dc/elements/1.1/" xmlns:cc="http://creativecommons.org/ns#" xmlns:rdf="http://www.w3.org/1999/02/22-rdf-syntax-ns#" xmlns:svg="http://www.w3.org/2000/svg" xmlns="http://www.w3.org/2000/svg" xmlns:sodipodi="http://sodipodi.sourceforge.net/DTD/sodipodi-0.dtd" xmlns:inkscape="http://www.inkscape.org/namespaces/inkscape" width="180mm" height="180mm" viewBox="0 0 180 180" version="1.1" id="svg5580" enable-background="new">
  <defs id="defs5574">
    
    
    
    
    
    
    
    
    
    
    
    <filter style="color-interpolation-filters:sRGB" id="filter4707">
      <feBlend mode="soft-light" in2="BackgroundImage" id="feBlend4709"/>
    </filter>
  </defs>
  
  <metadata id="metadata5577">
    
  </metadata>
  <g id="layer4" style="display:inline">
    <path style="display:inline;fill:#000000;fill-opacity:0.58823529;stroke:none;stroke-width:2px;stroke-linecap:butt;stroke-linejoin:miter;stroke-opacity:1;enable-background:new" d="m 562.43169,784.5743 c 0.0774,-2.46684 7.54034,-4.54238 20.46898,-6.10784 11.37219,-1.27199 27.43569,-2.0187 46.17158,-1.56798 8.00345,0.19222 16.67391,0.61264 25.71108,1.39392 0,0 10e-6,0 10e-6,0 7.56296,0.65042 15.63508,1.57524 23.90794,3.01695 6.17295,1.04698 12.953,2.49412 19.93626,4.93956 2.51561,0.86281 5.32176,2.05087 8.29881,3.72719 0.61828,0.30262 1.27553,0.68544 1.96435,1.15353 1.7294,1.17522 3.64562,2.87957 5.63126,5.17691 4.00894,5.28712 6.51824,10.45875 8.28345,14.83141 2.79259,6.53091 4.99144,12.99651 6.85361,19.08781 5.00956,16.34532 8.44229,32.2663 10.85904,45.65273 5.51131,35.47576 6.80192,58.93598 2.52907,59.85653 -0.004,9.2e-4 -0.0111,0.002 -0.007,0.001 0.004,-9.1e-4 -0.002,5e-4 -0.007,0.001 -4.28033,0.87219 -13.13726,-20.95565 -23.1815,-54.96442 -3.93509,-12.18127 -8.92099,-28.12977 -14.15973,-42.55283 -2.0416,-5.61228 -4.18718,-11.28777 -6.62435,-16.60005 -1.8656,-3.84931 -3.33601,-7.15183 -5.05077,-9.10797 0.51199,0.43313 0.58171,0.61244 0.31408,0.45638 -0.10633,-0.062 -0.26545,-0.17684 -0.46974,-0.34882 -0.96571,-0.59842 -2.37648,-1.15637 -4.09171,-1.81994 -4.79706,-1.8044 -10.28816,-3.05498 -15.92638,-4.27885 -7.34583,-1.56084 -14.85274,-2.82022 -22.00337,-3.95264 0,0 -10e-6,0 -10e-6,0 -8.44483,-1.3345 -16.94476,-2.54462 -24.57671,-3.62962 -18.4681,-2.62673 -33.31125,-4.73356 -44.84473,-6.98795 -12.74826,-2.37053 -20.06437,-4.91034 -19.987,-7.37684 z" id="path4670" transform="matrix(0.13229167,0,0,0.13229167,-5.3898644,-20.680979)"/>
  </g>
  <g id="g4605" style="display:none">
    <text id="text4603" y="153.0724" x="38.714001" style="font-style:normal;font-variant:normal;font-weight:normal;font-stretch:normal;font-size:10.58333302px;line-height:6.61458349px;font-family:'Montserrat Alternates';-inkscape-font-specification:'Montserrat Alternates';letter-spacing:0px;word-spacing:0px;display:inline;fill:#333333;fill-opacity:1;stroke:none;stroke-width:0.26458332;enable-background:new" xml:space="preserve"><tspan style="font-style:normal;font-variant:normal;font-weight:normal;font-stretch:normal;font-size:25.39999962px;font-family:Comfortaa;-inkscape-font-specification:Comfortaa;fill:#333333;fill-opacity:1;stroke-width:0.26458332" y="153.0724" x="38.714001" id="tspan4601">picasoft</tspan></text>
  </g>
  <g style="display:inline" id="g4769">
    <text xml:space="preserve" style="font-style:normal;font-variant:normal;font-weight:normal;font-stretch:normal;font-size:10.58333302px;line-height:6.61458349px;font-family:'Montserrat Alternates';-inkscape-font-specification:'Montserrat Alternates';letter-spacing:0px;word-spacing:0px;display:inline;fill:#333333;fill-opacity:1;stroke:none;stroke-width:0.26458332;enable-background:new" x="38.714001" y="153.04688" id="text4763"><tspan id="tspan4761" x="38.714001" y="153.04688" style="font-style:normal;font-variant:normal;font-weight:normal;font-stretch:normal;font-size:25.39999962px;font-family:Comfortaa;-inkscape-font-specification:Comfortaa;fill:#333333;fill-opacity:1;stroke-width:0.26458332">pica<tspan id="tspan4759" style="fill:#117f7f;fill-opacity:1">soft</tspan></tspan></text>
  </g>
  <g id="layer1" style="display:none">
    <text id="text4668" y="153.0724" x="27.072323" style="font-style:normal;font-variant:normal;font-weight:normal;font-stretch:normal;font-size:10.58333302px;line-height:6.61458349px;font-family:'Montserrat Alternates';-inkscape-font-specification:'Montserrat Alternates';letter-spacing:0px;word-spacing:0px;display:inline;fill:#333333;fill-opacity:1;stroke:none;stroke-width:0.26458332;enable-background:new" xml:space="preserve"><tspan style="font-style:normal;font-variant:normal;font-weight:normal;font-stretch:normal;font-size:25.39999962px;font-family:Comfortaa;-inkscape-font-specification:Comfortaa;fill:#333333;fill-opacity:1;stroke-width:0.26458332" y="153.0724" x="27.072323" id="tspan4666">pica<tspan style="fill:#333333;fill-opacity:1" id="tspan4653">soft</tspan></tspan></text>
    <text id="text4668-5" y="152.92746" x="126.70839" style="font-style:normal;font-variant:normal;font-weight:normal;font-stretch:normal;font-size:16.93333244px;line-height:6.61458349px;font-family:'Montserrat Alternates';-inkscape-font-specification:'Montserrat Alternates';letter-spacing:0px;word-spacing:0px;display:inline;fill:#333333;fill-opacity:1;stroke:none;stroke-width:0.26458332;enable-background:new" xml:space="preserve"><tspan style="font-style:normal;font-variant:normal;font-weight:normal;font-stretch:normal;font-size:16.93333244px;font-family:Comfortaa;-inkscape-font-specification:Comfortaa;fill:#333333;fill-opacity:1;stroke-width:0.26458332" y="152.92746" x="126.70839" id="tspan4666-4">.net</tspan></text>
  </g>
  <g id="g4847" style="display:inline">
    <g style="display:inline;filter:url(#filter4707);enable-background:new" id="g4845" transform="matrix(0.13229167,0,0,0.13229167,-5.3898644,-20.680979)">
      <circle cx="809.08154" cy="658.9682" id="circle4819" style="opacity:1;fill:#000000;fill-opacity:0.58823529;stroke:none;stroke-width:19.11594391;stroke-miterlimit:4;stroke-dasharray:none;stroke-opacity:0.58823529" r="18.897636"/>
      <circle r="22.677164" cx="683.66809" cy="671.25568" id="circle4821" style="display:inline;opacity:1;fill:#000000;fill-opacity:0.58823529;stroke:none;stroke-width:22.9391346;stroke-miterlimit:4;stroke-dasharray:none;stroke-opacity:0.58823529;enable-background:new"/>
      <circle r="26.456692" cx="762.37891" cy="728.17908" id="circle4823" style="display:inline;opacity:1;fill:#000000;fill-opacity:0.58823529;stroke:none;stroke-width:26.76232529;stroke-miterlimit:4;stroke-dasharray:none;stroke-opacity:0.58823529;enable-background:new"/>
      <circle r="22.677164" cx="872.17084" cy="667.67291" id="circle4825" style="display:inline;opacity:1;fill:#000000;fill-opacity:0.58823529;stroke:none;stroke-width:22.9391346;stroke-miterlimit:4;stroke-dasharray:none;stroke-opacity:0.58823529;enable-background:new"/>
      <circle r="26.456692" cx="701.09943" cy="567.67285" id="circle4827" style="display:inline;opacity:1;fill:#000000;fill-opacity:0.58823529;stroke:none;stroke-width:26.76232529;stroke-miterlimit:4;stroke-dasharray:none;stroke-opacity:0.58823529;enable-background:new"/>
      <circle r="26.456692" cx="867.88507" cy="562.67285" id="circle4829" style="display:inline;opacity:1;fill:#000000;fill-opacity:0.58823529;stroke:none;stroke-width:26.76232529;stroke-miterlimit:4;stroke-dasharray:none;stroke-opacity:0.58823529;enable-background:new"/>
      <path style="fill:none;stroke:#000000;stroke-width:12.09448814;stroke-linecap:butt;stroke-linejoin:miter;stroke-miterlimit:4;stroke-dasharray:none;stroke-opacity:0.58823529" d="m 868.90886,588.34654 2.38085,57.54619" id="path4831"/>
      <path style="fill:none;stroke:#000000;stroke-width:12.09448814;stroke-linecap:butt;stroke-linejoin:miter;stroke-miterlimit:4;stroke-dasharray:none;stroke-opacity:0.58823529" d="m 784.9349,715.6604 68.1179,-37.43219" id="path4833"/>
      <circle cx="9.4488182" cy="9.4488182" id="circle4835" style="display:inline;opacity:1;fill:#000000;fill-opacity:0.58823529;stroke:none;stroke-width:9.55797195;stroke-miterlimit:4;stroke-dasharray:none;stroke-opacity:0.58823529;filter:url(#filter4707);enable-background:new" r="9.4488182" transform="matrix(1.9999999,0,0,1.9999999,765.41604,518.06096)"/>
      <path style="fill:none;stroke:#000000;stroke-width:12.8503933;stroke-linecap:butt;stroke-linejoin:miter;stroke-miterlimit:4;stroke-dasharray:none;stroke-opacity:0.58823529" d="m 794.15837,551.77549 66.17609,97.69557" id="path4837"/>
      <path style="fill:none;stroke:#000000;stroke-width:12.8503933;stroke-linecap:butt;stroke-linejoin:miter;stroke-miterlimit:4;stroke-dasharray:none;stroke-opacity:0.58823529" d="M 724.93956,558.62219 767.61242,542.8567" id="path4839"/>
      <path style="fill:none;stroke:#000000;stroke-width:12.8503933;stroke-linecap:butt;stroke-linejoin:miter;stroke-miterlimit:4;stroke-dasharray:none;stroke-opacity:0.58823529" d="m 697.2202,654.38333 76.99542,-102.9832" id="path4841"/>
      <path style="opacity:1;fill:none;stroke:#000000;stroke-width:12.8503933;stroke-linecap:butt;stroke-linejoin:miter;stroke-miterlimit:4;stroke-dasharray:none;stroke-opacity:0.58823529" d="m 850.7313,664.63564 -24.12841,-3.45712" id="path4843"/>
    </g>
  </g>
  <g id="layer7" style="display:none">
    <text id="text4668-3" y="170.08763" x="6.6842098" style="font-style:normal;font-variant:normal;font-weight:normal;font-stretch:normal;font-size:10.58333302px;line-height:6.61458349px;font-family:'Montserrat Alternates';-inkscape-font-specification:'Montserrat Alternates';letter-spacing:0px;word-spacing:0px;display:inline;fill:#333333;fill-opacity:1;stroke:none;stroke-width:0.26458332;enable-background:new" xml:space="preserve"><tspan style="font-style:italic;font-variant:normal;font-weight:normal;font-stretch:normal;font-size:11.28888893px;font-family:'Montserrat Alternates';-inkscape-font-specification:'Montserrat Alternates Italic';fill:#333333;fill-opacity:1;stroke-width:0.26458332" y="170.08763" x="6.6842098" id="tspan4666-6">soustitre stylé pas tjrs présent</tspan></text>
  </g>
  <g id="layer10" style="display:inline">
    <g style="display:inline;enable-background:new" id="g4761-7" transform="matrix(0.13229167,0,0,0.13229167,-5.3898644,-20.680973)">
      <g id="g5083-4" style="display:inline" transform="translate(160.33913,51.406037)">
        <path id="path4996-8" d="m 721.7077,455.97731 c -0.0192,-0.0389 -0.0353,-0.0793 -0.0483,-0.12122 -0.0127,-0.0411 -0.0225,-0.0835 -0.0293,-0.12736 -0.0136,-0.0876 -0.0153,-0.18074 -0.005,-0.27935 0,0 0,0 0,0 l 0,0 c 0.02,-0.19698 0.0869,-0.41548 0.19962,-0.65512 0,0 0,0 0,0 l 0,0 c 0.22472,-0.47783 0.63145,-1.03818 1.21273,-1.67608 l 0,0 c 1.15507,-1.26756 2.99435,-2.83465 5.46356,-4.65852 l 0,0 c 4.85816,-3.58845 12.11024,-8.1387 21.34784,-13.29367 l 0,0 c 17.3955,-9.70888 42.01622,-21.69264 70.40992,-32.66242 3.90926,-1.51054 7.89744,-3.00399 11.95359,-4.46669 9.91356,-3.57496 19.56965,-6.72686 29.01776,-9.45461 14.1342,-4.08654 27.04249,-7.00898 39.34897,-8.76983 13.12543,-1.91623 23.90826,-2.21909 33.52515,-0.86895 5.24004,0.7258 9.55564,1.9855 13.05227,3.6034 6.9998,3.19054 8.76766,7.20162 8.0235,8.15042 -0.80167,1.02213 -4.36843,-0.0893 -10.12825,-0.50788 -3.27513,-0.22046 -6.63825,-0.16121 -11.34683,0.23184 -8.90123,0.75303 -17.352,2.46791 -29.92108,5.63875 -11.53165,2.95359 -23.07363,6.49516 -36.80457,11.05662 -9.07146,3.01806 -18.25854,6.2282 -27.9816,9.73497 -3.95376,1.42599 -7.86828,2.85483 -11.71979,4.27014 -28.04848,10.30862 -53.05727,20.005 -71.74067,26.61508 l 0,0 c -9.85041,3.48536 -17.96857,6.13676 -23.75382,7.61985 l 0,0 c -2.94997,0.75626 -5.31335,1.21412 -7.01155,1.33369 l 0,0 c -0.85598,0.0603 -1.54533,0.0346 -2.05812,-0.0815 l 0,0 c 0,0 0,0 0,0 -0.2573,-0.0582 -0.47047,-0.13943 -0.63814,-0.2439 l 0,0 c 0,0 0,0 0,0 -0.084,-0.0523 -0.15668,-0.11055 -0.21778,-0.17471 -0.0306,-0.0321 -0.0583,-0.0657 -0.0831,-0.10084 -0.0253,-0.0358 -0.0475,-0.0732 -0.0667,-0.11211 z" style="display:inline;fill:#000000;stroke:none;stroke-width:2px;stroke-linecap:butt;stroke-linejoin:miter;stroke-opacity:1"/>
        <path id="path4998-5" d="m 793.1317,528.93731 c -1.55436,-2.22622 6.22749,-10.66464 20.09419,-22.54478 0,0 0,0 0,0 12.96326,-11.24173 31.02058,-25.52025 51.50168,-41.11985 2.07263,-1.57862 4.16684,-3.16829 6.28233,-4.76989 7.66043,-5.7996 15.64529,-11.78909 22.66089,-17.03275 9.67583,-7.23393 18.58899,-13.85805 26.38901,-19.717 8.23195,-6.20258 15.07558,-11.37764 20.31498,-15.52348 2.81333,-2.23599 5.08319,-4.03975 6.88015,-5.51827 0,0 0,0 0,0 2.63361,-2.30902 4.82113,-3.7659 5.62077,-3.56598 1.21231,0.30307 1.76625,3.02371 0.009,7.44813 0,-10e-6 0,0 0,0 -0.99296,2.60472 -2.5455,5.45294 -4.76107,8.73081 -4.21401,6.25532 -9.83935,12.77844 -17.52739,20.50218 -7.20817,7.25215 -15.46252,14.73838 -24.98821,22.71628 -7.04185,5.89867 -14.55539,11.87188 -22.5254,17.90584 -2.14087,1.62081 -4.27218,3.21385 -6.38932,4.77761 -20.88672,15.42739 -40.52598,28.11492 -55.44,36.59141 0,0 0,10e-6 0,10e-6 -15.96206,8.94632 -26.56665,13.34615 -28.12117,11.11973 z" style="display:inline;fill:#000000;stroke:none;stroke-width:2px;stroke-linecap:butt;stroke-linejoin:miter;stroke-opacity:1"/>
        <path id="path5000-8" d="m 784.6837,533.54531 c 2.03566,-0.70749 8.23514,11.05438 17.15789,31.75954 0,0 0,10e-6 0,10e-6 7.63842,20.77109 15.65135,50.68897 18.5781,87.09425 1.77095,22.11671 1.52821,46.21447 -1.85593,71.31806 -2.28881,16.9784 -5.8426,33.1335 -10.43962,48.34671 0,0 -10e-6,2e-5 -10e-6,2e-5 -12.51318,41.26397 -32.17124,72.94348 -48.4811,93.5921 -16.26884,20.59671 -28.65284,30.33713 -30.39509,28.79211 -1.74226,-1.54502 7.29744,-14.05782 20.2297,-35.80272 12.98237,-21.82916 29.39219,-52.97291 40.03625,-91.95207 0,0 1e-5,-10e-6 1e-5,-10e-6 3.95192,-14.41099 7.08194,-29.62886 9.2338,-45.64329 3.17945,-23.66195 3.87209,-46.44127 3.05417,-67.53553 -1.3293,-34.65322 -6.55709,-63.57202 -10.98334,-84.70943 0,0 0,-10e-6 0,-10e-6 -5.7444,-21.49291 -8.1695,-34.55258 -6.13483,-35.25974 z" style="display:inline;fill:#000000;stroke:none;stroke-width:2px;stroke-linecap:butt;stroke-linejoin:miter;stroke-opacity:1"/>
        <path id="path5002-2" d="m 729.05538,902.28976 c 0.0316,3.3e-4 0.063,0.007 0.0944,0.0209 0.0307,0.0133 0.0612,0.0329 0.0916,0.0588 0,0 0,0 0,0 0.0606,0.0518 0.12012,0.12848 0.17863,0.2299 0,0 0,0 0,0 l 0,0 c 0.11652,0.20249 0.22731,0.50156 0.33037,0.89552 l 0,0 0,0 c 0.20424,0.78078 0.37322,1.91751 0.48139,3.39882 l 0,0 c 0.21076,2.88614 0.18838,7.01209 -0.33099,12.17741 l 0,0 c -0.96031,9.59546 -3.67502,23.16353 -10.48519,37.39469 l 0,0 c -3.25414,6.79654 -7.47182,13.71707 -12.84652,20.22367 -1.28344,1.55271 -2.63068,3.07634 -4.04132,4.56458 -4.83872,5.10489 -10.10751,9.4609 -15.59323,13.05754 -9.24552,6.05001 -18.80745,9.77601 -27.37159,11.95931 -21.25183,5.4088 -35.57614,2.8847 -35.58924,1.44 -0.0131,-1.4447 14.17189,-1.6237 33.61559,-8.16253 7.81384,-2.62466 16.45413,-6.47867 24.68109,-12.17466 4.89405,-3.38138 9.62133,-7.39421 14.01824,-12.0333 1.28218,-1.35281 2.51239,-2.73375 3.69033,-4.1375 4.93949,-5.88226 8.96401,-12.16704 12.22962,-18.35575 l 0,0 c 6.82954,-12.93705 10.44317,-25.62533 12.63655,-34.63378 l 0,0 c 1.17943,-4.85446 1.97254,-8.78424 2.59979,-11.52675 l 0,0 c 0.32033,-1.40073 0.60234,-2.50697 0.85789,-3.24403 l 0,0 0,0 c 0.13036,-0.376 0.25673,-0.66407 0.37998,-0.85714 l 0,0 c 0,0 0,0 0,0 0.0621,-0.0976 0.12398,-0.17149 0.18547,-0.22093 0,0 0,0 0,0 0.0309,-0.0248 0.0617,-0.0435 0.0926,-0.056 0.0315,-0.0128 0.063,-0.0191 0.0946,-0.0187 z" style="display:inline;fill:#000000;stroke:none;stroke-width:2px;stroke-linecap:butt;stroke-linejoin:miter;stroke-opacity:1"/>
        <path id="path5004-6" d="m 621.50399,1006.624 c 0.27374,0.7801 -7.54357,4.3343 -21.14111,9.7691 -13.0283,4.0619 -31.97986,7.9159 -54.21286,6.2435 -10.80064,-0.8258 -22.24424,-3.0124 -33.71668,-7.0507 -5.08845,-1.7933 -10.14254,-3.9397 -15.12119,-6.4426 -7.05437,-3.5464 -13.61847,-7.6381 -19.64469,-12.09784 -13.78229,-10.20796 -24.64278,-22.15328 -32.9292,-33.3559 -21.07635,-28.49329 -27.80395,-51.36137 -26.56226,-51.91356 1.24169,-0.55219 10.21404,21.23101 31.69667,47.95627 8.43054,10.48745 19.12316,21.68835 32.27667,31.18715 5.75037,4.15618 11.97419,7.98864 18.62694,11.33468 4.69591,2.3618 9.449,4.4024 14.22553,6.1249 10.76664,3.8874 21.55133,6.1368 31.77969,7.1899 20.93536,2.1839 39.44633,-0.6094 52.2761,-3.4187 13.85531,-4.199 22.17277,-6.3059 22.44639,-5.5262 z" style="display:inline;fill:#000000;stroke:none;stroke-width:2px;stroke-linecap:butt;stroke-linejoin:miter;stroke-opacity:1"/>
        <path id="path5006-0" d="m 426.24,953.248 c -2.10456,0.96255 -11.08748,-17.1097 -33.29942,-40.74827 -9.93173,-10.58133 -21.25669,-20.79736 -36.10559,-32.81948 -11.67506,-9.43999 -24.83718,-19.32778 -38.60716,-30.57864 -12.26026,-10.00101 -25.29863,-21.48481 -37.19438,-34.75577 -11.38491,-12.71485 -21.73474,-27.32257 -29.90482,-43.6932 -0.26995,-0.5409 -0.53708,-1.08286 -0.80137,-1.62585 -9.74451,-20.12358 -15.45229,-41.13136 -18.39462,-61.32581 -4.30895,-29.60247 -3.25229,-58.08241 -0.66991,-82.09329 3.50667,-32.75503 10.1589,-60.9404 15.28475,-78.81283 5.30634,-18.50178 9.57406,-28.60886 11.2334,-28.2063 3.31869,0.80513 -6.76745,43.43399 -10.09758,108.32591 -1.18231,23.27221 -1.21613,50.5197 3.38647,77.78735 3.1295,18.55143 8.49704,37.65778 17.24503,55.58253 0.23496,0.48424 0.47251,0.96778 0.71261,1.45061 7.26165,14.60254 16.52827,27.87544 26.71527,39.65863 10.65261,12.33553 22.7949,23.54862 34.34529,33.68465 13.02693,11.41238 25.82578,21.98028 37.24927,32.36614 14.44777,13.118 25.74981,25.07323 34.97875,37.12183 20.8986,27.30709 26.02857,47.71924 23.92401,48.68179 z" style="display:inline;fill:#000000;stroke:none;stroke-width:2px;stroke-linecap:butt;stroke-linejoin:miter;stroke-opacity:1"/>
        <path id="path5008-6" d="m 257.27778,520.69653 c -0.0441,0.0131 -0.0903,0.0187 -0.13861,0.0171 -0.0494,-0.007 -0.10155,-0.0228 -0.15647,-0.0486 0,0 0,0 0,0 -0.10955,-0.0515 -0.22999,-0.14119 -0.36115,-0.26866 0,0 -1e-5,0 -1e-5,0 l 0,0 c -0.261,-0.25374 -0.56391,-0.6567 -0.90726,-1.20596 l 0,0 c -0.67927,-1.08666 -1.51293,-2.73976 -2.48837,-4.94028 l 0,0 c -1.90228,-4.29141 -4.32351,-10.61546 -7.14852,-18.83183 l 0,0 c -5.21399,-15.16417 -11.97147,-37.25341 -18.82747,-64.17155 l 0,0 c -5.893,-23.12928 -12.29163,-51.4028 -17.05886,-81.85143 l 0,0 c -2.03707,-13.00897 -3.8263,-26.7944 -4.97848,-41.00891 l 0,0 c -0.98279,-12.0618 -1.53316,-24.7542 -1.04995,-37.72408 l 0,0 c 0.35884,-10.33111 1.4324,-21.27743 4.26929,-32.26171 l 0,0 c 1.15321,-4.46126 2.70005,-9.02706 4.81988,-13.54331 l 0,0 c 1.81773,-3.90609 4.2107,-7.80759 7.32045,-11.44802 2.83256,-3.30806 6.33547,-6.22404 10.44762,-8.48046 0,0 4e-5,-2e-5 4e-5,-2e-5 4.18957,-2.23439 8.68596,-3.58838 13.22763,-4.07542 0.73591,-0.0753 1.46796,-0.13228 2.19566,-0.17167 4.42088,-0.23929 8.65199,0.17079 12.5798,1.01515 5.75232,1.2139 11.07558,3.1241 15.95177,5.3507 14.06527,6.42036 26.25296,15.20278 37.02935,23.98429 17.1824,13.90717 32.523,29.1712 46.13511,43.67447 21.70041,23.10052 40.93113,46.49872 56.6013,66.52424 0,0 1e-5,2e-5 1e-5,2e-5 43.36446,55.40881 66.91679,93.18786 64.49147,94.99338 -2.42533,1.80551 -30.3603,-32.75796 -76.16558,-85.35524 -1e-5,-10e-6 -1e-5,-10e-6 -2e-5,-2e-5 -16.4431,-18.87894 -36.52563,-41.49321 -58.1865,-63.38178 -13.69703,-13.82924 -28.76928,-28.29236 -45.10076,-41.14356 -10.40409,-8.12945 -21.29224,-15.96423 -32.97189,-21.10032 -3.98689,-1.75184 -7.93565,-3.19958 -11.81005,-3.96488 -2.61994,-0.50183 -5.13833,-0.78854 -7.43284,-0.65036 -0.37783,0.0228 -0.74926,0.057 -1.11384,0.10363 -2.16832,0.2566 -4.23589,0.84453 -5.94454,1.79043 0,0 -2e-5,0 -2e-5,0 -1.73181,0.89464 -3.37785,2.3061 -4.86416,3.97209 -1.68876,1.88602 -3.12025,4.28116 -4.42074,6.92196 l 0,0 c -1.4991,3.0819 -2.6562,6.49534 -3.64032,10.07475 l 0,0 c -2.44933,8.90283 -3.43585,18.47127 -3.96677,28.04135 l 0,0 c -0.63009,11.9313 -0.31491,23.92032 0.36196,35.53943 l 0,0 c 0.80159,13.66234 2.1826,27.093 3.76409,39.8604 l 0,0 c 3.68235,29.72064 8.78091,58.23365 13.14892,81.28626 5.15139,27.1765 9.81623,49.32199 12.89505,65.1343 l 0,0 c 1.64689,8.4579 2.85624,15.14135 3.48743,19.74766 l 0,0 c 0.32506,2.37216 0.50016,4.21443 0.50945,5.48846 l 0,0 c 0.005,0.6453 -0.0331,1.14693 -0.11511,1.50033 l 0,0 c 0,0 0,0 0,0 -0.0412,0.17782 -0.0937,0.31829 -0.15762,0.42086 0,0 0,10e-6 0,10e-6 -0.0321,0.0514 -0.067,0.0934 -0.10481,0.1257 -0.0396,0.0276 -0.0815,0.048 -0.12556,0.0611 z" style="display:inline;fill:#000000;stroke:none;stroke-width:2px;stroke-linecap:butt;stroke-linejoin:miter;stroke-opacity:1"/>
        <path id="path5010-6" d="m 456.71179,382.00174 c -0.11963,-4.1169 36.38598,-8.71117 88.81722,-11.75952 18.11637,0.30178 37.85666,1.64983 58.67608,4.45798 12.18954,1.64414 23.9154,3.67636 35.11549,6.01234 0,0 1e-5,0 1e-5,0 32.21825,6.74378 58.57843,15.75353 77.38552,23.95712 18.52686,8.08135 28.71008,14.79827 27.82641,16.9753 -0.88366,2.17703 -12.61838,-0.49548 -31.81729,-5.1986 -20.09757,-4.92326 -45.05405,-11.05469 -77.0645,-16.65546 0,0 -10e-6,-1e-5 -10e-6,-1e-5 -10.85376,-1.90598 -22.11654,-3.67809 -33.84857,-5.2737 -20.07248,-2.72995 -38.88207,-4.58505 -56.4257,-5.91328 -51.95888,-0.0137 -88.5451,-2.48752 -88.66466,-6.60217 z" style="display:inline;fill:#000000;stroke:none;stroke-width:2px;stroke-linecap:butt;stroke-linejoin:miter;stroke-opacity:1"/>
        <path style="fill:#000000;stroke:none;stroke-width:2px;stroke-linecap:butt;stroke-linejoin:miter;stroke-opacity:1" d="m 591.74401,958.84801 c 0.0271,-0.0474 0.0576,-0.092 0.0918,-0.13494 0.0331,-0.0414 0.0694,-0.0808 0.109,-0.1182 0.0789,-0.0745 0.17097,-0.1416 0.27538,-0.20068 0,0 0,0 0,0 l 0,0 c 0.20713,-0.11784 0.4654,-0.2075 0.77017,-0.26835 l 0,0 c 0.60383,-0.12058 1.40347,-0.13651 2.37227,-0.062 l 0,0 c 1.891,0.1453 4.52284,0.63394 7.67169,1.29702 l 0,0 c 6.14161,1.28999 14.36015,3.25022 23.93158,4.51564 5.11273,0.66489 10.59553,1.13555 16.24055,1.17043 4.88765,0.0302 9.48846,-0.26845 13.86366,-0.87223 0,0 10e-6,0 10e-6,0 10.02158,-1.33685 18.31822,-4.30802 24.49488,-6.62918 6.12685,-2.30244 10.09601,-3.82526 11.17099,-2.53751 1.01422,1.21494 -0.93825,5.27178 -6.50102,10.15098 -5.53261,4.85273 -14.58492,10.32252 -26.63554,12.98315 0,0 -10e-6,0 -10e-6,0 -5.18793,1.12774 -10.70731,1.72376 -16.46377,1.70303 -6.67342,-0.024 -12.9864,-0.87389 -18.71155,-2.2121 -10.6326,-2.46671 -19.17385,-6.484 -24.80295,-10.1184 l 0,0 c -2.92572,-1.88711 -5.08129,-3.67483 -6.42182,-5.17964 l 0,0 c -0.68031,-0.76374 -1.14727,-1.44758 -1.39389,-2.03578 l 0,0 c -0.12411,-0.29605 -0.1927,-0.56503 -0.20374,-0.8073 l 0,0 c 0,0 0,0 0,-10e-6 -0.005,-0.12124 0.004,-0.23494 0.0268,-0.34169 0.0117,-0.0534 0.0269,-0.10489 0.0457,-0.15453 0.0195,-0.0514 0.0426,-0.10035 0.0697,-0.1477 z" id="path5045-4"/>
        <path style="fill:#000000;stroke:none;stroke-width:2px;stroke-linecap:butt;stroke-linejoin:miter;stroke-opacity:1" d="m 615.29977,985.732 c -0.63974,-2.59351 5.93847,-6.44912 14.68352,-8.60627 8.74505,-2.15716 16.3617,-1.80301 17.00144,0.7905 0.63975,2.59351 -5.93847,6.44912 -14.68352,8.60627 -8.74505,2.15716 -16.3617,1.80301 -17.00144,-0.7905 z" id="path5049-6"/>
      </g>
    </g>
  </g>
</svg>
