-0.95 -1.05
-1.35 -0.56
0.75 1.62
-0.93 0.88
-0.44 0.32
-0.02 1.31
1.13 0.26
0.40 -0.23
0.86 0.65
1.70 0.28
0.19 1.51
-1.33 2.75
-1.66 1.31
0.90 0.55
2.46 1.48
0.70 -0.58
-0.54 0.45
0.67 0.67
0.67 -0.72
-0.70 -0.58
0.97 0.87
-0.30 1.77
-0.89 0.16
1.67 1.09
-0.70 0.37

